1-Methyldiadamantane
- Formula: C15H22
- Molecular weight: 202.3352
- IUPAC Standard InChIKey: NOMKXIVITNLMHM-UHFFFAOYSA-N
- CAS Registry Number: 26460-76-4
- Chemical structure:
View 3d structure (requires JavaScript / HTML 5) - Permanent link for this species. Use this link for bookmarking this species for future reference.

Gas phase thermochemistry data

Data compiled by: Hussein Y. Afeefy, Joel F. Liebman, and Stephen E. Stein
Quantity | Value | Units | Method | Reference | Comment |
---|---|---|---|---|---|
ΔfH°gas | -166.7 ± 3.6 | kJ/mol | Ccb | Clark, Knox, et al., 1979 | Gas flow technique for Hs,see Clark, Knox, et al., 1975 |

Condensed phase thermochemistry data

Data compiled by: Hussein Y. Afeefy, Joel F. Liebman, and Stephen E. Stein
Quantity | Value | Units | Method | Reference | Comment |
---|---|---|---|---|---|
ΔfH°solid | -247.4 ± 3.3 | kJ/mol | Ccb | Clark, Knox, et al., 1979 | Gas flow technique for Hs,see Clark, Knox, et al., 1975 |
Quantity | Value | Units | Method | Reference | Comment |
ΔcH°solid | -8799.4 ± 3.3 | kJ/mol | Ccb | Clark, Knox, et al., 1979 | Gas flow technique for Hs,see Clark, Knox, et al., 1975; Corresponding ΔfHºsolid = -247.4 kJ/mol (simple calculation by NIST; no Washburn corrections) |

Phase change data

Data compiled as indicated in comments:
ALS - Hussein Y. Afeefy, Joel F. Liebman, and Stephen E. Stein
DRB - Donald R. Burgess, Jr.
AC - William E. Acree, Jr., James S. Chickos
Quantity | Value | Units | Method | Reference | Comment |
---|---|---|---|---|---|
ΔsubH° | 80.63 | kJ/mol | V | Clark, Knox, et al., 1979 | Gas flow technique for Hs,see Clark, Knox, et al., 1975; ALS |
ΔsubH° | 80.7 | kJ/mol | N/A | Clark, Knox, et al., 1979 | DRB |
Enthalpy of sublimation
ΔsubH (kJ/mol) | Temperature (K) | Method | Reference | Comment |
---|---|---|---|---|
80.7 ± 0.4 | 321. | TSGC | Clark, Knox, et al., 1975, 2 | Based on data from 310. to 333. K.; AC |

References

Clark, Knox, et al., 1979
Clark, T.; Knox, T.M.O.; McKervey, M.A.; Mackle, H.; Rooney, J.J.,
Thermochemistry of bridged-ring substances. Enthalpies of formation of some diamondoid hydrocarbons and of perhydroquinacene. Comparisons with data from empirical force field calculations,
J. Am. Chem. Soc., 1979, 101, 2404-2410. [all data]
Clark, Knox, et al., 1975
Clark, T.; Knox, T.M.; Mackle, H.; McKervey, M.A.; Rooney, J.J.,
Calorimetric evaluation of enthalpies of formation of some bridged-ring hydrocarbons. Comparison with data from empirical force field calculations.,
J. Am. Chem. Soc., 1975, 97, 3835-3836. [all data]
Clark, Knox, et al., 1975, 2
Clark, Timothy; Knox, Trevor; Mackle, Henry; McKervey, M. Anthony; Rooney, John J.,
Heats of sublimation of some cage hydrocarbons by a temperature scanning technique,
J. Chem. Soc., Faraday Trans. 1, 1975, 71, 0, 2107, https://doi.org/10.1039/f19757102107
. [all data]