1,2,3,4-Tetrahydro-1-hydroperoxynaphthalene
- Formula: C10H12O2
- Molecular weight: 164.2011
- IUPAC Standard InChIKey: YWBMNCRJFZGXJY-UHFFFAOYSA-N
- CAS Registry Number: 26447-24-5
- Chemical structure:
View 3d structure (requires JavaScript / HTML 5) - Species with the same structure:

Condensed phase thermochemistry data

Data compiled by: Hussein Y. Afeefy, Joel F. Liebman, and Stephen E. Stein
Quantity | Value | Units | Method | Reference | Comment |
---|---|---|---|---|---|
ΔfH°solid | -187.4 ± 5.4 | kJ/mol | Ccb | Breitenbach and Derkosch, 1951 | Reanalyzed by Cox and Pilcher, 1970, Original value = -187. kJ/mol |
Quantity | Value | Units | Method | Reference | Comment |
ΔcH°solid | -5468.5 ± 8.4 | kJ/mol | Ccb | Pritzkow and Muller, 1956 | Corresponding ΔfHºsolid = -181.6 kJ/mol (simple calculation by NIST; no Washburn corrections) |
ΔcH°solid | -5462.6 | kJ/mol | Ccb | Breitenbach and Derkosch, 1951 | Corresponding ΔfHºsolid = -187. kJ/mol (simple calculation by NIST; no Washburn corrections) |

References

Breitenbach and Derkosch, 1951
Breitenbach, J.W.; Derkosch, J.,
Verbrennungswarmen von peroxyden und verwandten verbindungen sowie von polystrolen,
Monatsh. Chem., 1951, 82, 177-179. [all data]
Cox and Pilcher, 1970
Cox, J.D.; Pilcher, G.,
Thermochemistry of Organic and Organometallic Compounds, Academic Press, New York, 1970, 1-636. [all data]
Pritzkow and Muller, 1956
Pritzkow, W.; Muller, K.A.,
Uber die energetische stellung der organischen hydroperoxyde und die o-o-bindungsenergie,
Chem. Ber., 1956, 89, 2318-2321. [all data]