Glycerol monoacetate
- Formula: C5H10O4
- Molecular weight: 134.1305
- IUPAC Standard InChIKey: KMZHZAAOEWVPSE-UHFFFAOYSA-N
- CAS Registry Number: 26446-35-5
- Chemical structure:
View 3d structure (requires JavaScript / HTML 5) - Species with the same structure:
- Other names: Acetoglyceride; glycerol acetate; Monoacetine

Condensed phase thermochemistry data

Data compiled by: Hussein Y. Afeefy, Joel F. Liebman, and Stephen E. Stein
Quantity | Value | Units | Method | Reference | Comment |
---|---|---|---|---|---|
ΔfH°liquid | -903.53 | kJ/mol | Ccb | Tavernier and Lamouroux, 1956 | Author's hf298_condensed=-218.52 kcal/mol |
Quantity | Value | Units | Method | Reference | Comment |
ΔcH°liquid | -2487.5 ± 3.7 | kJ/mol | Ccb | Tavernier and Lamouroux, 1956 | Reanalyzed by Cox and Pilcher, 1970, Original value = -2493.2 kJ/mol; Author's hf298_condensed=-218.52 kcal/mol; Corresponding ΔfHºliquid = -909.18 kJ/mol (simple calculation by NIST; no Washburn corrections) |

Van Den Dool and Kratz RI, polar column, temperature ramp

Column type | Active phase | I | Reference | Comment |
---|---|---|---|---|
Capillary | DB-FFAP | 2250. | Charles, Martin, et al., 2000 | 30. m/0.32 mm/0.25 μm, H2, 40. C @ 2. min, 5. K/min; Tend: 240. C |

Normal alkane RI, non-polar column, temperature ramp

Column type | Active phase | I | Reference | Comment |
---|---|---|---|---|
Capillary | DP-5 | 1091. | Vijayakumar, Duraipandiyan, et al., 2012 | 30. m/0.25 mm/0.25 μm, Helium, 80. C @ 1. min, 4. K/min, 300. C @ 40. min |

Normal alkane RI, polar column, custom temperature program

Column type | Active phase | I | Reference | Comment |
---|---|---|---|---|
Capillary | Stabilwax | 2271. | Chinnici, Guerrero, et al., 2009 | 30. m/0.25 mm/0.25 μm, Helium; Program: 35 0C 3 0C/min -> 100 0C 5 0C/min -> 240 0C (10 min) |

References

Tavernier and Lamouroux, 1956
Tavernier, P.; Lamouroux, M.,
Determinations calorimetriques relatives a vingt-six substances organiques,
Mem. Poudres, 1956, 38, 65-88. [all data]
Cox and Pilcher, 1970
Cox, J.D.; Pilcher, G.,
Thermochemistry of Organic and Organometallic Compounds, Academic Press, New York, 1970, 1-636. [all data]
Charles, Martin, et al., 2000
Charles, M.; Martin, B.; Ginies, C.; Etievant, P.; Coste, G.; Guichard, E.,
Potent aroma compounds of two red wine vinegars,
J. Agric. Food Chem., 2000, 48, 1, 70-77, https://doi.org/10.1021/jf9905424
. [all data]
Vijayakumar, Duraipandiyan, et al., 2012
Vijayakumar, A.; Duraipandiyan, V.; Jeyarai, B.; Agastian, P.; Raj, M.K.; Ignacimunthu, S.,
Phytochemical analysis and in vitro antimicrobial activity of Illicium griffithii Hook f. Thoms extracts,
Asian Pacific J. Tropical Diseases, 2012, 2, 3, 190-199, https://doi.org/10.1016/S2222-1808(12)60045-0
. [all data]
Chinnici, Guerrero, et al., 2009
Chinnici, F.; Guerrero, E.D.; Sonni, F.; Natali, N.; Marin, R.N.; Riponi, C.,
Gas chromatography - mass spectrometry (GC-MS) characterization of volatile compounds in quality vinegars with protected Europian geographical indication,
J. Agric. Food Chem., 2009, 57, 11, 4784-4792, https://doi.org/10.1021/jf804005w
. [all data]