Benzocycloheptatriene
- Formula: C11H10
- Molecular weight: 142.1971
- IUPAC Standard InChIKey: XHVULKQHRQZNMW-UHFFFAOYSA-N
- CAS Registry Number: 264-09-5
- Chemical structure:
View 3d structure (requires JavaScript / HTML 5) - Other names: 3,4-Benzotropilidene

Phase change data

Data compiled by: Robert L. Brown and Stephen E. Stein
Reduced pressure boiling point
Tboil (K) | Pressure (bar) | Reference |
---|---|---|
379.6 to 380. | 0.016 | Buckingham and Donaghy, 1982 |

Lee's RI, non-polar column, custom temperature program

Column type | Active phase | I | Reference | Comment |
---|---|---|---|---|
Capillary | DB-5 | 220.3 | Fuentes, Font, et al., 2007 | Column length: 60. m; Program: not specified |

References

Buckingham and Donaghy, 1982
Buckingham, J.; Donaghy, S.M.,
Dictionary of Organic Compounds: Fifth Edition, Chapman and Hall, New York, 1982, 1. [all data]
Fuentes, Font, et al., 2007
Fuentes, M.J.; Font, R.; Gomez-Rico, M.F.; Martin-Gullon, I.,
Pyrolysis and combustion of waste lubricant oil from diesel cars: Decomposition and pollutants,
J. Anal. Appl. Pyrolysis, 2007, 79, 1-2, 215-226, https://doi.org/10.1016/j.jaap.2006.12.004
. [all data]