10-Hydroxydecanoic acid, methyl ester

Normal alkane RI, non-polar column, temperature ramp

Data compiled by: NIST Mass Spectrometry Data Center, William E. Wallace, director

Column type Capillary
Active phase OV-101
Column length (m) 50.
Carrier gas
Substrate
Column diameter (mm) 0.32
Phase thickness (μm)
Tstart (C) 100.
Tend (C) 250.
Heat rate (K/min) 2.
Initial hold (min)
Final hold (min)
I 1567.
ReferenceTressl, Bahri, et al., 1982
Comment MSDC-RI

References

Tressl, Bahri, et al., 1982
Tressl, R.; Bahri, D.; Engel, K.-H., Formation of eight-carbon and ten-carbon components in mushrooms (Agaricus campestris), J. Agric. Food Chem., 1982, 30, 1, 89-93, https://doi.org/10.1021/jf00109a019 . [all data]