Rubidium anion
- Formula: Rb-
- Molecular weight: 85.4683
- CAS Registry Number: 26396-76-9

Gas phase thermochemistry data

Quantity | Value | Units | Method | Reference | Comment |
---|---|---|---|---|---|
S°gas,1 bar | 164.33 | J/mol*K | Review | Chase, 1998 | Data last reviewed in December, 1983 |

Reaction thermochemistry data

Data compiled by: John E. Bartmess
Individual Reactions
Rb- + = HRb
Quantity | Value | Units | Method | Reference | Comment |
---|---|---|---|---|---|
ΔrH° | 1436.7 ± 2.1 | kJ/mol | D-EA | Frey, Breyer, et al., 1978 | gas phase; Given: 3919.18(16) cm-1 |
Quantity | Value | Units | Method | Reference | Comment |
ΔrG° | 1417.4 ± 2.4 | kJ/mol | H-TS | Frey, Breyer, et al., 1978 | gas phase; Given: 3919.18(16) cm-1 |

Gas phase ion energetics data

Data compiled by: John E. Bartmess
Protonation reactions
Rb- + = HRb
Quantity | Value | Units | Method | Reference | Comment |
---|---|---|---|---|---|
ΔrH° | 1436.7 ± 2.1 | kJ/mol | D-EA | Frey, Breyer, et al., 1978 | gas phase; Given: 3919.18(16) cm-1 |
Quantity | Value | Units | Method | Reference | Comment |
ΔrG° | 1417.4 ± 2.4 | kJ/mol | H-TS | Frey, Breyer, et al., 1978 | gas phase; Given: 3919.18(16) cm-1 |

References

Chase, 1998
Chase, M.W., Jr.,
NIST-JANAF Themochemical Tables, Fourth Edition,
J. Phys. Chem. Ref. Data, Monograph 9, 1998, 1-1951. [all data]
Frey, Breyer, et al., 1978
Frey, P.; Breyer, F.; Hotop, H.,
High Resolutions Photodetachment from the Rubidium Negative Ion around the Rb(5p1/2) Threshold,
J. Phys. B: Atom. Mol. Phys., 1978, 11, 19, L589, https://doi.org/10.1088/0022-3700/11/19/005
. [all data]