Butanoic acid, hexyl ester
- Formula: C10H20O2
- Molecular weight: 172.2646
- IUPAC Standard InChIKey: XAPCMTMQBXLDBB-UHFFFAOYSA-N
- CAS Registry Number: 2639-63-6
- Chemical structure:
View 3d structure (requires JavaScript / HTML 5) - Isotopologues:
- Other names: Butyric acid, hexyl ester; n-Hexyl butanoate; n-Hexyl butyrate; n-Hexyl n-butyrate; Hexyl butanoate; Hexyl butyrate; 1-Hexyl butyrate; n-Hexyl n-butanoate; Esyl butanoate

Phase change data

Data compiled by: Thermodynamics Research Center, NIST Boulder Laboratories, Chris Muzny director
Quantity | Value | Units | Method | Reference | Comment |
---|---|---|---|---|---|
Tboil | 466. | K | N/A | Musaev, Mekhtiev, et al., 1967 | Uncertainty assigned by TRC = 2. K |
Tboil | 478.25 | K | N/A | Hoffmann, 1959 | Uncertainty assigned by TRC = 1. K |
Tboil | 481.03 | K | N/A | Bilterys and Gisseleire, 1935 | Uncertainty assigned by TRC = 0.3 K |
Tboil | 478.3 | K | N/A | Gartenmeister, 1886 | Uncertainty assigned by TRC = 1.5 K |
Quantity | Value | Units | Method | Reference | Comment |
Tfus | 195.2 | K | N/A | Bilterys and Gisseleire, 1935 | Uncertainty assigned by TRC = 0.5 K |

Normal alkane RI, polar column, custom temperature program

Data compiled by: NIST Mass Spectrometry Data Center, William E. Wallace, director

Column type CapillaryCapillaryCapillaryCapillaryCapillary
Active phase InnowaxHP-InnowaxDB-WaxDB-WaxFFAP
Column length (m) 30. 20.30.50.
Carrier gas Helium HeliumHeliumHe
Substrate
Column diameter (mm) 0.25 0.180.320.2
Phase thickness (μm) 0.25 0.180.500.33
Program not specifiednot specified35 0C (1 min) 2/9 0C/min -> 100 0C 8 0C/min -> 200 0C (5 min)40 0C 7 0C/min -> 110 0C 15 0C/min -> 250 0C (3 min)70C(1min) => 3C/min => 142C => 5C/min => 225C (10min)
I 1410.1417.1406.1432.1426.
ReferenceSiristova, Prinosilova, et al., 2012Yasuda and Higuchi, 2012Rowan, Hunt, et al., 2009Valappil, Fan, et al., 2009Lara, Echeverría, et al., 2007
Comment MSDC-RI MSDC-RI MSDC-RI MSDC-RI MSDC-RI
Column type CapillaryCapillaryCapillaryCapillaryCapillary
Active phase FFAPCP-Wax 52CBDB-WaxHP-Innowax FSCFFAP
Column length (m) 50. 60.60.50.
Carrier gas HeHydrogenHeHeHe
Substrate
Column diameter (mm) 0.2 0.250.250.2
Phase thickness (μm) 0.33 0.250.250.33
Program 70C(1min) => 3C/min => 142C => 5C/min => 225C(10min)not specified35C(5min) => 2C/min => 50C => 5C/min => 200C (5min)60C (10min) => 4C/min => 220C (10min) => 1C/min => 240C70C(1min) => 3C/min => 142C => 5C/min => 225C(10min)
I 1426.1414.1420.1424.1426.
ReferenceLopez, Villatoro, et al., 2007Jales, Maia, et al., 2005Mattheis, Fan, et al., 2005Demirci and Baser, 2004Echeverría, Correa, et al., 2004
Comment MSDC-RI MSDC-RI MSDC-RI MSDC-RI MSDC-RI
Column type CapillaryCapillaryCapillaryCapillaryCapillary
Active phase Carbowax 20MHP-FFAPFFAPCross-linked FFAPInnowax
Column length (m)  50.50.50.60.
Carrier gas  HeN2N2
Substrate
Column diameter (mm)  0.20.20.20.25
Phase thickness (μm)  0.330.330.330.25
Program not specified70C(1min) => 3C/min => 142C => 5C/min => 225C (10min)70C(1min) => 3C/min => 142C(2min) => 25C/min => 230C(5min)70C(1min) => 3C/min => 142C (2min) => 25C/min => 230C(5min)60C(10min) => 4C/min => 220C(10min) => 1C/min => 240C
I 1398.1426.1433.1433.1424.
ReferenceVinogradov, 2004Echeverria, Fuentes, et al., 2003Lopez, Lavilla, et al., 2000Lavilla, Puy, et al., 1999Baser, Kürkcüoglu, et al., 1998
Comment MSDC-RI MSDC-RI MSDC-RI MSDC-RI MSDC-RI
Column type Capillary
Active phase FFAP
Column length (m) 50.
Carrier gas N2
Substrate
Column diameter (mm) 0.2
Phase thickness (μm) 0.33
Program 70C (1min) => 3C/min => 142C (2min) => 25C/min => 230C (5min)
I 1433.
ReferenceLópez, Lavilla, et al., 1998
Comment MSDC-RI

Normal alkane RI, non-polar column, custom temperature program

Data compiled by: NIST Mass Spectrometry Data Center, William E. Wallace, director

Column type CapillaryCapillaryCapillaryCapillaryCapillary
Active phase HP-1CP-Sil 8 CBHP-5DB-5DB-5
Column length (m)  30.30.60.30.
Carrier gas  HydrogenHeliumHeliumHelium
Substrate
Column diameter (mm)  0.250.320.250.25
Phase thickness (μm)  0.250.251.000.25
Program not specified30 0C 3 0C/min -> 150 0C 20 0C/min -> 220 0Cnot specified40 0C 4 0C/min -> 230 0C 100 0C/min -> 260 0C (11.7 min)50 0C m6 0C/min -> 140 0C 5 0C/min -> 160 0C (1 min) 10 0C/min -> 200 0C
I 1192.1193.1193.1188.1192.
ReferenceYasuda and Higuchi, 2012de Freitas, Garruti, et al., 2011Kahriman, Tosun, et al., 2011Miyazaki, Plotto, et al., 2011Courtois, Paine, et al., 2009
Comment MSDC-RI MSDC-RI MSDC-RI MSDC-RI MSDC-RI
Column type CapillaryCapillaryCapillaryCapillaryCapillary
Active phase BPX-5LM-5LM-5LM-5VB-5
Column length (m) 30.30.30.30.60.
Carrier gas HeliumHeliumHeliumHeliumHe
Substrate
Column diameter (mm) 0.250.250.250.250.25
Phase thickness (μm) 0.25   1.
Program 70 0C (1 min) 3 0C/min -> 142 0C 5 0C/min -> 225 0C (10 min)50 0C (10 min) 2 oC/min -> 75 0C 3 0C/min -> 150 0C 5 0C/min -> 200 0Cnot specifiednot specified35C(1min) => 4C/min => 175C => 10C/min => 260C
I 1197.1200.1185.1195.1184.
ReferenceOrtiz, Echeverra, et al., 2009Janzanntti, Franco, et al., 2007Janzanntti, Franco, et al., 2007Janzanntti, Franco, et al., 2007Karlshøj, Nielsen, et al., 2007
Comment MSDC-RI MSDC-RI MSDC-RI MSDC-RI MSDC-RI
Column type CapillaryCapillaryCapillaryCapillaryCapillary
Active phase SE-30SPB-5SE-30HP-5HP-5
Column length (m)  30. 30.30.
Carrier gas  He
Substrate
Column diameter (mm)  0.25 0.250.25
Phase thickness (μm)  0.25 0.250.25
Program not specified30C(3min) => 5C/min => 80C => 4C/min => 95C => 5C/min => 115C => 10C/min => 200Cnot specifiednot specifiednot specified
I 1156.1191.1176.1191.1192.
ReferenceLiu, Liang, et al., 2007Crook, Boylston, et al., 2004Vinogradov, 2004Jordán, Goodner, et al., 2002Jordán, Goodner, et al., 2002
Comment MSDC-RI MSDC-RI MSDC-RI MSDC-RI MSDC-RI
Column type CapillaryCapillaryCapillaryCapillary
Active phase DB-1DB-1OV-101OV-101
Column length (m) 30.30.50.50.
Carrier gas H2H2HeHe
Substrate
Column diameter (mm) 0.250.250.240.24
Phase thickness (μm) 0.250.25
Program 30C (2min) => 2C/min => 150C => 4C/min => 250C30C (2min) => 2C/min => 150C => 4C/min => 250Cnot specifiednot specified
I 1174.1175.1175.1176.
ReferenceTakeoka, Flath, et al., 1988Takeoka, Flath, et al., 1988Zenkevich and Malamakhov, 1987Zenkevich and Malamakhov, 1987
Comment MSDC-RI MSDC-RI MSDC-RI MSDC-RI

Kovats' RI, non-polar column, temperature ramp

Data compiled by: NIST Mass Spectrometry Data Center, William E. Wallace, director

Column type CapillaryCapillaryCapillaryCapillaryCapillary
Active phase SE-54DB-5HP-5MSDB-5DB-1
Column length (m) 50.30.30.30.60.
Carrier gas  HeHeHeHe
Substrate
Column diameter (mm) 0.210.260.320.250.32
Phase thickness (μm)  0.250.250.250.25
Tstart (C) 80.60.70.60.30.
Tend (C) 200.246.250.240.210.
Heat rate (K/min) 2.3.3.4.2.
Initial hold (min)   5. 4.
Final hold (min)
I 1195.1191.1184.1190.1178.
ReferenceJanzanntti, Franco, et al., 2000Adams, 1999Siani, Ramos, et al., 1999da Silva, Zoghbi, et al., 1999Takeoka, Buttery, et al., 1992
Comment MSDC-RI MSDC-RI MSDC-RI MSDC-RI MSDC-RI
Column type CapillaryCapillaryCapillaryCapillaryCapillary
Active phase DB-1DB-1DB-1DB-1DB-1
Column length (m) 60.60.60.60.60.
Carrier gas HeHeHeHeHe
Substrate
Column diameter (mm) 0.320.320.320.320.32
Phase thickness (μm) 0.250.250.250.250.25
Tstart (C) 30.30.30.30.30.
Tend (C) 210.210.210.210.210.
Heat rate (K/min) 2.2.2.2.2.
Initial hold (min) 4.4.4.4.4.
Final hold (min)
I 1178.1178.1188.1178.1179.
ReferenceTakeoka, Buttery, et al., 1992Takeoka, Flath, et al., 1990Takeoka, Flath, et al., 1990Takeoka, Flath, et al., 1990Takeoka, Flath, et al., 1990
Comment MSDC-RI MSDC-RI MSDC-RI MSDC-RI MSDC-RI

Kovats' RI, polar column, temperature ramp

Data compiled by: NIST Mass Spectrometry Data Center, William E. Wallace, director

Column type CapillaryCapillaryCapillaryCapillaryCapillary
Active phase SupelcowaxSupelcowaxDB-WaxDB-WaxDB-Wax
Column length (m) 30.30.60.60.30.
Carrier gas   HeHeN2
Substrate
Column diameter (mm) 0.250.250.250.250.25
Phase thickness (μm) 0.250.250.250.25
Tstart (C) 60.60.40.40.60.
Tend (C) 240.240.200.200.200.
Heat rate (K/min) 3.3.3.3.2.
Initial hold (min) 5.5.5.5.10.
Final hold (min) 10.10.
I 1410.1398.1419.1420.1419.
ReferenceRiu-Aumatell, Castellari, et al., 2004Riu-Aumatell, Castellari, et al., 2004Tatsuka, Suekane, et al., 1990Tatsuka, Suekane, et al., 1990Umano, Shoji, et al., 1986
Comment MSDC-RI MSDC-RI MSDC-RI MSDC-RI MSDC-RI

Kovats' RI, non-polar column, custom temperature program

Data compiled by: NIST Mass Spectrometry Data Center, William E. Wallace, director

Column type CapillaryCapillaryCapillaryCapillary
Active phase SPB-1SPB-1SE-54SE-30
Column length (m) 30.30.50.
Carrier gas
Substrate
Column diameter (mm) 0.250.250.21
Phase thickness (μm) 0.250.25
Program not specifiednot specified50C (10min) => 2C/min => 75C => 3C/min => 150C => 5C/min => 200Cnot specified
I 1175.1174.1200.1156.
ReferenceRiu-Aumatell, Castellari, et al., 2004Riu-Aumatell, Castellari, et al., 2004Janzanntti, Franco, et al., 2000Chretien and Dubois, 1978
Comment MSDC-RI MSDC-RI MSDC-RI MSDC-RI

References

Musaev, Mekhtiev, et al., 1967
Musaev; Mekhtiev; Abilova,
Sint. Prevrashch. Monomernykh Soedin., 1967, 1967, 33-5. [all data]
Hoffmann, 1959
Hoffmann, W.L.,
Riechst. Aromen, 1959, 9, 273. [all data]
Bilterys and Gisseleire, 1935
Bilterys, R.; Gisseleire, J.,
Investigations on the Congelation Temperature of Organic Compounds,
Bull. Soc. Chim. Belg., 1935, 44, 567. [all data]
Gartenmeister, 1886
Gartenmeister, R.,
Investigation of the physical characterstics of liquid compounds: vi boiling point and specific volume of normal fatty acid esters,
Justus Liebigs Ann. Chem., 1886, 233, 249-315. [all data]