Benzene, (1,1,2-trimethylpropyl)-
- Formula: C12H18
- Molecular weight: 162.2713
- IUPAC Standard InChIKey: KOZDEDRKEDUXDC-UHFFFAOYSA-N
- CAS Registry Number: 26356-11-6
- Chemical structure:
View 3d structure (requires JavaScript / HTML 5) - Other names: 2,3-Dimethyl-2-phenylbutane; (1,1,2-Trimethylpropyl)benzene

Phase change data

Data compiled by: Thermodynamics Research Center, NIST Boulder Laboratories, Chris Muzny director
Quantity | Value | Units | Method | Reference | Comment |
---|---|---|---|---|---|
Tboil | 487.15 | K | N/A | Pines and Mark, 1956 | Uncertainty assigned by TRC = 3. K |

Normal alkane RI, polar column, temperature ramp

Column type | Active phase | I | Reference | Comment |
---|---|---|---|---|
Capillary | Carbowax 20M | 1364. | Herain, MRAVEC, et al., 1991 | 70. C @ 21. min, 5. K/min, 150. C @ 999. min |

References

Pines and Mark, 1956
Pines, H.; Mark, V.,
Carbanions Additions in the Reaction of Aromatic Hydrocarbons with Monoolefins,
J. Am. Chem. Soc., 1956, 78, 4316. [all data]
Herain, MRAVEC, et al., 1991
Herain, J.; MRAVEC, D.; SCHNIERER, A.,
identification of the components of the reaction mixtures from transalkylation of the waste fraction of diisopropylbenzenes by capillary GC and GC-MS,
Chem. Listy, 1991, 85, 5, 535-538. [all data]