4-Bromo-1,2-(methylenedioxy)benzene
- Formula: C7H5BrO2
- Molecular weight: 201.017
- IUPAC Standard InChIKey: FBOYMIDCHINJKC-UHFFFAOYSA-N
- CAS Registry Number: 2635-13-4
- Chemical structure:
View 3d structure (requires JavaScript / HTML 5) - Other names: 3,4-Methylenedioxybromobenzene; 4-Bromomethylenedioxybenzene; 5-bromobenzo-1,3-dioxole

Phase change data

Data compiled by: Robert L. Brown and Stephen E. Stein
Reduced pressure boiling point
Tboil (K) | Pressure (bar) | Reference |
---|---|---|
358.7 | 0.001 | Weast and Grasselli, 1989 |
392. to 393. | 0.027 | Frinton Laboratories Inc., 1986 |

References

Weast and Grasselli, 1989
CRC Handbook of Data on Organic Compounds, 2nd Editon, Weast,R.C and Grasselli, J.G., ed(s)., CRC Press, Inc., Boca Raton, FL, 1989, 1. [all data]
Frinton Laboratories Inc., 1986
Frinton Laboratories Inc.,
Catalog Number 11, Frinton Laboratories Inc., Vineland, NJ, 1986, 99. [all data]