Methyl(trifluoromethyl)phosphinous acid, methyl ester

Phase change data

Data compiled by: William E. Acree, Jr., James S. Chickos

Enthalpy of vaporization

ΔvapH (kJ/mol) Temperature (K) Reference Comment
33.9258.Burg and Kang, 1970Based on data from 232. - 285. K.

References

Burg and Kang, 1970
Burg, Anton B.; Kang, Dae-Ki., Oxygen and sulfur chemistry of methyltrifluoromethylphosphines, J. Am. Chem. Soc., 1970, 92, 7, 1901-1908, https://doi.org/10.1021/ja00710a020 . [all data]