Benzene, 1,3,5-trichloro-2,4,6-trinitro-
- Formula: C6Cl3N3O6
- Molecular weight: 316.440
- IUPAC Standard InChIKey: LZMONXBJUOXABQ-UHFFFAOYSA-N
- CAS Registry Number: 2631-68-7
- Chemical structure:
View 3d structure (requires JavaScript / HTML 5) - Other names: Bulbosan; TCTNB; 1,3,5-Trichloro-2,4,6-Trinitrobenzene; Trichloro-1,3,5-Trinitrobenzene; sym-Trichlorotrinitrobenzene; 1,3,5-trichlorotrinitrobenzene

Phase change data

Data compiled by: William E. Acree, Jr., James S. Chickos
Enthalpy of vaporization
ΔvapH (kJ/mol) | Temperature (K) | Method | Reference | Comment |
---|---|---|---|---|
68.9 | 518. | A | Stephenson and Malanowski, 1987 | Based on data from 503. to 543. K. See also Maksimov, 1968. |
43.2 | 518. | N/A | Dykyj, 1972 | Based on data from 503. to 543. K. |

References

Stephenson and Malanowski, 1987
Stephenson, Richard M.; Malanowski, Stanislaw,
Handbook of the Thermodynamics of Organic Compounds, 1987, https://doi.org/10.1007/978-94-009-3173-2
. [all data]
Maksimov, 1968
Maksimov, Y.Y.,
Russ. J. Phys. Chem., 1968, 42, 11, 1550. [all data]
Dykyj, 1972
Dykyj, J.,
Petrochemia, 1972, 12, 1, 13. [all data]