2,4-Dihydroxy-5,6-dimethylpyrimidine
- Formula: C6H8N2O2
- Molecular weight: 140.1399
- IUPAC Standard InChIKey: PZVLJGKJIMBYNP-UHFFFAOYSA-N
- CAS Registry Number: 26305-13-5
- Chemical structure:
View 3d structure (requires JavaScript / HTML 5) - Other names: 5,6-Dimethyluracil; 2,4(1H,3H)-Pyrimidinedione, 5,6-dimethyl-; Uracil, 5,6-dimethyl-; 4,5-Dimethyluracil

Gas phase ion energetics data

Data compiled by: John E. Bartmess
De-protonation reactions
C6H7N2O2- + =
By formula: C6H7N2O2- + H+ = C6H8N2O2
Quantity | Value | Units | Method | Reference | Comment |
---|---|---|---|---|---|
ΔrH° | 1460. ± 13. | kJ/mol | IMRB | Lee, 2005 | gas phase |

Reaction thermochemistry data

Data compiled by: John E. Bartmess

Individual Reactions

C6H7N2O2- + Hydrogen cation = 2,4-Dihydroxy-5,6-dimethylpyrimidine

By formula: C6H7N2O2- + H+ = C6H8N2O2

Quantity Value Units Method Reference Comment
Δr1460. ± 13.kJ/molIMRBLee, 2005gas phase

References

Lee, 2005
Lee, J.K.,
Insights into nucleic acid reactivity through gas-phase experimental and computational studies,
Int. J. Mass Spectrom., 2005, 240, 3, 261-272, https://doi.org/10.1016/j.ijms.2004.09.020
. [all data]