cis-2-Methyl-1-vinylcyclopropane
- Formula: C6H10
- Molecular weight: 82.1436
- IUPAC Standard InChIKey: JVVPJIPOOZHNTM-UHFFFAOYSA-N
- CAS Registry Number: 2628-57-1
- Chemical structure:
View 3d structure (requires JavaScript / HTML 5) - Stereoisomers:

Gas phase thermochemistry data

Data compiled by: Hussein Y. Afeefy, Joel F. Liebman, and Stephen E. Stein
Quantity | Value | Units | Method | Reference | Comment |
---|---|---|---|---|---|
ΔfH°gas | 103. | kJ/mol | Chyd | Roth, Adamczak, et al., 1991 |

Reaction thermochemistry data

Data compiled by: Hussein Y. Afeefy, Joel F. Liebman, and Stephen E. Stein
Individual Reactions
By formula: 2H2 + C6H10 = C6H14
Quantity | Value | Units | Method | Reference | Comment |
---|---|---|---|---|---|
ΔrH° | -270. ± 0.4 | kJ/mol | Chyd | Roth, Kirmse, et al., 1982 | liquid phase; solvent: Isooctane |

References

Roth, Adamczak, et al., 1991
Roth, W.R.; Adamczak, O.; Breuckmann, R.; Lennartz, H.-W.; Boese, R.,
Die Berechnung von Resonanzenergien; das MM2ERW-Kraftfeld,
Chem. Ber., 1991, 124, 2499-2521. [all data]
Roth, Kirmse, et al., 1982
Roth, W.R.; Kirmse, W.; Hoffmann, W.; Lennartz, H.W.,
Heats of hydrogenation. III. Effect of fluoro substituents on the thermal rearrangement of cyclopropane systems,
Chem. Ber., 1982, 115, 2508-2515. [all data]