Disiloxane, 1,3-diethenyl-1,1,3,3-tetramethyl-
- Formula: C8H18OSi2
- Molecular weight: 186.3989
- IUPAC Standard InChIKey: BITPLIXHRASDQB-UHFFFAOYSA-N
- CAS Registry Number: 2627-95-4
- Chemical structure:
View 3d structure (requires JavaScript / HTML 5) - Other names: Disiloxane, 1,1,3,3-tetramethyl-1,3-divinyl-; Tetramethyl-1,3-divinyldisiloxane; 1,1,3,3-Tetramethyl-1,3-divinyldisiloxane; 1,1,3,3-Tetramethyl-1,3-divinylsiloxane; 1,3-Diethenyl-1,1,3,3-tetramethyl disiloxane; 1,3-Divinyl-1,1,3,3-tetramethyldisiloxane; 1,3-Divinyltetramethyldisiloxane; CD6210; sym-Tetramethyldi(ethenyl)disiloxane; 1,1'-Divinyltetramethyldisiloxane; 846574-60-5; Tetramethyldivinylsiloxane; Bisvinyltetramethyldisiloxane; Divinyltetramethyldisiloxane

Phase change data

Data compiled by: Robert L. Brown and Stephen E. Stein
Quantity | Value | Units | Method | Reference | Comment |
---|---|---|---|---|---|
Tboil | 412. | K | N/A | PCR Inc., 1990 |

Van Den Dool and Kratz RI, non-polar column, custom temperature program

Column type | Active phase | I | Reference | Comment |
---|---|---|---|---|
Capillary | VF-5MS | 848. | Tretyakov, 2011 | 30. m/0.25 mm/0.25 μm, He; Program: Multi-step temperature program; T(initial)=60C; T(final)=270C |

References

PCR Inc., 1990
PCR Inc.,
Research Chemicals Catalog 1990-1991, PCR Inc., Gainesville, FL, 1990, 1. [all data]
Tretyakov, 2011
Tretyakov, K.V.,
Retention Data. NIST Mass Spectrometry Data Center., NIST Mass Spectrometry Data Center, 2011. [all data]