Benzenemethanamine, α-methyl-, (S)-
- Formula: C8H11N
- Molecular weight: 121.1796
- IUPAC Standard InChIKey: RQEUFEKYXDPUSK-SSDOTTSWSA-N
- CAS Registry Number: 2627-86-3
- Chemical structure:
View 3d structure (requires JavaScript / HTML 5) - Stereoisomers:
- Other names: (S)-α-Methylbenzenemethanamine; L-(-)-α-Phenylethylamine; (-)-α-Phenethylamine; L(-)-α-Methylbenzylamine; (S)-(-)-α-Methylbenzylamine; L-(-)-1-Phenylethylamine; L-α-methylbenzylamine

Phase change data

Data compiled as indicated in comments:
BS - Robert L. Brown and Stephen E. Stein
AC - William E. Acree, Jr., James S. Chickos
Quantity | Value | Units | Method | Reference | Comment |
---|---|---|---|---|---|
Tboil | 460.2 | K | N/A | Aldrich Chemical Company Inc., 1990 | BS |
Quantity | Value | Units | Method | Reference | Comment |
ΔvapH° | 54.6 ± 0.1 | kJ/mol | C | Atik, Saito, et al., 1987 | AC |

References

Aldrich Chemical Company Inc., 1990
Aldrich Chemical Company Inc.,
Catalog Handbook of Fine Chemicals, Aldrich Chemical Company, Inc., Milwaukee WI, 1990, 1. [all data]
Atik, Saito, et al., 1987
Atik, Zadjia; Saito, Yoshihiro; Kusano, Kazuhito,
Thermodynamic properties of liquid enantiomers I. Enthalpies of vaporization of fenchones, α-methylbenzylamines, and limonenes at 298.15 K,
The Journal of Chemical Thermodynamics, 1987, 19, 1, 99-102, https://doi.org/10.1016/0021-9614(87)90167-4
. [all data]