4-Bromobutyric acid
- Formula: C4H7BrO2
- Molecular weight: 167.001
- IUPAC Standard InChIKey: GRHQDJDRGZFIPO-UHFFFAOYSA-N
- CAS Registry Number: 2623-87-2
- Chemical structure:
View 3d structure (requires JavaScript / HTML 5) - Other names: 4-Bromo-n-butyric acid; Butanoic acid, 4-bromo-; Butyric acid, 4-bromo-; 4-Bromobutanoic acid; γ-Bromobutyric acid; Carboxypropyl bromide

Phase change data

Data compiled by: Robert L. Brown and Stephen E. Stein
Quantity | Value | Units | Method | Reference | Comment |
---|---|---|---|---|---|
Tfus | 306. | K | N/A | Buckingham and Donaghy, 1982 |
Reduced pressure boiling point
Tboil (K) | Pressure (bar) | Reference |
---|---|---|
402.7 | 0.015 | Aldrich Chemical Company Inc., 1990 |
381. to 382. | 0.003 | Buckingham and Donaghy, 1982 |

References

Buckingham and Donaghy, 1982
Buckingham, J.; Donaghy, S.M.,
Dictionary of Organic Compounds: Fifth Edition, Chapman and Hall, New York, 1982, 1. [all data]
Aldrich Chemical Company Inc., 1990
Aldrich Chemical Company Inc.,
Catalog Handbook of Fine Chemicals, Aldrich Chemical Company, Inc., Milwaukee WI, 1990, 1. [all data]