2-Pentene, 4,4-dimethyl-
- Formula: C7H14
- Molecular weight: 98.1861
- IUPAC Standard InChIKey: BIDIHFPLDRSAMB-UHFFFAOYSA-N
- CAS Registry Number: 26232-98-4
- Chemical structure:
View 3d structure (requires JavaScript / HTML 5) - Stereoisomers:
- Other names: 4,4-Dimethyl-2-pentene; CH3CH=CHC(CH3)3

Phase change data

Data compiled by: Thermodynamics Research Center, NIST Boulder Laboratories, Chris Muzny director
Quantity | Value | Units | Method | Reference | Comment |
---|---|---|---|---|---|
Tboil | 349.9 | K | N/A | Shiner, Boskin, et al., 1955 | Uncertainty assigned by TRC = 0.6 K |
Tboil | 349.15 | K | N/A | Goldwasser and Taylor, 1939 | Uncertainty assigned by TRC = 0.5 K |
Tboil | 349.85 | K | N/A | Wibaut, Hoog, et al., 1939 | Uncertainty assigned by TRC = 1.5 K |
Tboil | 358.15 | K | N/A | Lebedew and Kudijawzew, 1935 | Uncertainty assigned by TRC = 3. K |
Tboil | 358.15 | K | N/A | Favorskii and Alekseeva, 1920 | Uncertainty assigned by TRC = 3. K |
Quantity | Value | Units | Method | Reference | Comment |
Tfus | 154.29 | K | N/A | Shiner, Boskin, et al., 1955 | Uncertainty assigned by TRC = 0.3 K |

Normal alkane RI, non-polar column, temperature ramp

Column type | Active phase | I | Reference | Comment |
---|---|---|---|---|
Capillary | OV-101 | 644. | Mandelshtam, Kharicheva, et al., 1991 | Helium, 50. C @ 0. min, 3. K/min, 220. C @ 0. min; Column length: 54. m; Column diameter: 0.26 mm |

References

Shiner, Boskin, et al., 1955
Shiner, V.J.; Boskin, M.J.; Smith, M.L.,
J. Am. Chem. Soc., 1955, 77, 5525. [all data]
Goldwasser and Taylor, 1939
Goldwasser, S.; Taylor, H.S.,
Catalytic dehydration of c6-c8 aliphatic alcohols,
J. Am. Chem. Soc., 1939, 61, 1751. [all data]
Wibaut, Hoog, et al., 1939
Wibaut, J.P.; Hoog, H.; Langedijk, S.L.; Overhoff, J.; Smittenberg, J.; Benninga, N.; Bouman, G.P.; van Dijk, H.; Gaade, W.; Geldof, H.; Hackmann, J.Th.; Jonker, E.W.; Paap, T.; Zuiderweg, F.J.,
Study on the Preparation and the Physical Constants of A Number of Alkanes and Cycloalkanes,
Recl. Trav. Chim. Pays-Bas, 1939, 58, 329. [all data]
Lebedew and Kudijawzew, 1935
Lebedew; Kudijawzew,
J. Gen. Chem. USSR (Engl. Transl.), 1935, 5, 1859. [all data]
Favorskii and Alekseeva, 1920
Favorskii, A.E.; Alekseeva, O.,
Zh. Russ. Fiz.-Khim. O-va., Chast Khim., 1920, 50, 561. [all data]
Mandelshtam, Kharicheva, et al., 1991
Mandelshtam, T.V.; Kharicheva, E.M.; Gorobets, I.A.; Zenkevich, I.G.; Kostikov, R.R.; Porokhovnikova, E.B.,
Synthesis and Chromato Mass Spectrometric Investigation of alpha-Alkoxystyrenes,
Zh. Org. Khim. (Rus.), 1991, 27, 4, 684-690. [all data]