4-sec-Butyl-2-(α-methylbenzyl)phenol
- Formula: C18H22O
- Molecular weight: 254.3667
- IUPAC Standard InChIKey: QJNBIFRUSFIANU-UHFFFAOYSA-N
- CAS Registry Number: 2622-83-5
- Chemical structure:
View 3d structure (requires JavaScript / HTML 5) - Other names: 4-sec-Butyl-2-(α-methylbenzyl)alcohol; Phenol, 4-(1-methylpropyl)-2-(1-phenylethyl)-; Phenol, 4-sec-butyl-2-(α-methylbenzyl)-; 4-(1-methylpropyl)-2-(1-phenylethyl)phenol; 4-Sec-butyl-2-(a-methylbenzyl)phenol

Phase change data

Data compiled by: Robert L. Brown and Stephen E. Stein
Reduced pressure boiling point
Tboil (K) | Pressure (bar) | Reference |
---|---|---|
447. to 453. | 0.003 | Frinton Laboratories Inc., 1986 |

References

Frinton Laboratories Inc., 1986
Frinton Laboratories Inc.,
Catalog Number 11, Frinton Laboratories Inc., Vineland, NJ, 1986, 99. [all data]