Carbamic acid, methylphenyl-, ethyl ester
- Formula: C10H13NO2
- Molecular weight: 179.2157
- IUPAC Standard InChIKey: QHGZFCAIXRVHID-UHFFFAOYSA-N
- CAS Registry Number: 2621-79-6
- Chemical structure:
View 3d structure (requires JavaScript / HTML 5) - Other names: Carbanilic acid, N-methyl-, ethyl ester; Ethyl methylphenylcarbamate; Ethyl N-methyl-N-phenylcarbamate; N-Methylcarbanilic acid, ethyl ester; N-Methyl-N-phenylurethane

Condensed phase thermochemistry data

Data compiled by: Hussein Y. Afeefy, Joel F. Liebman, and Stephen E. Stein
Quantity | Value | Units | Method | Reference | Comment |
---|---|---|---|---|---|
ΔfH°liquid | -384. ± 5.0 | kJ/mol | Ccb | Medard and Thomas, 1954 | Heat of combustion corrected for pressure |
ΔfH°liquid | -377.0 | kJ/mol | Ccb | Medard, 1954 | Heat of combustion corrected for pressure |
Quantity | Value | Units | Method | Reference | Comment |
ΔcH°liquid | -5409.1 ± 5.0 | kJ/mol | Ccb | Medard and Thomas, 1954 | Heat of combustion corrected for pressure |
ΔcH°liquid | -5416.02 | kJ/mol | Ccb | Medard, 1954 | Heat of combustion corrected for pressure |
Quantity | Value | Units | Method | Reference | Comment |
ΔfH°solid | -165. | kJ/mol | Ccb | Schmidt and Becker, 1933 | |
Quantity | Value | Units | Method | Reference | Comment |
ΔcH°solid | -5628.3 | kJ/mol | Ccb | Schmidt and Becker, 1933 |

References

Medard and Thomas, 1954
Medard, L.; Thomas, M.,
Chaleurs de combustion de vingt-quatre substances explosives ou apparentees a des explosifs,
Mem. Poudres, 1954, 36, 97-127. [all data]
Medard, 1954
Medard, L.,
Tables thermochimiques a l'usage des techniciens des substances explosives,
Mem. Artillerie Fr. Sci. Tech. Armement, 1954, 28, 415-492. [all data]
Schmidt and Becker, 1933
Schmidt, V.A.; Becker, F.,
Die Bildungswarme von Nitrocellulofen, Nitroglycerin und anderen widuigen Beltandteilen von Treibmitteln,
Z. Gesamte Schiess Sprengstoffwes., 1933, 33, 280-282. [all data]