4-Tridecanol
- Formula: C13H28O
- Molecular weight: 200.3608
- IUPAC Standard InChIKey: VHNLHPIEIIHMHH-UHFFFAOYSA-N
- CAS Registry Number: 26215-92-9
- Chemical structure:
View 3d structure (requires JavaScript / HTML 5) - Other names: tridecan-4-ol

Kovats' RI, polar column, isothermal

Column type | Active phase | Temperature (C) | I | Reference | Comment |
---|---|---|---|---|---|
Packed | Carbowax 20M | 130. | 1856. | Singliar, 1972 | Column length: 2.55 m |
Packed | Carbowax 20M | 165. | 1862. | Singliar, 1972 | Column length: 2.55 m |

Normal alkane RI, non-polar column, custom temperature program

Column type | Active phase | I | Reference | Comment |
---|---|---|---|---|
Capillary | OV-101 | 1582. | Qin, 2009 | Program: not specified |

Normal alkane RI, polar column, custom temperature program

Column type | Active phase | I | Reference | Comment |
---|---|---|---|---|
Capillary | PEG-20M | 1887. | Qin, 2009 | Program: not specified |

References

Singliar, 1972
Singliar, M.,
Chromatographic Behaviour and the Structure of Secondary Aliphatic Alcohols,
J. Chromatogr., 1972, 65, 1, 311-321, https://doi.org/10.1016/S0021-9673(00)86946-0
. [all data]
Qin, 2009
Qin, Z.,
Relationship between the molecular structure and gas chromatographic retention index of alcohol isomer,
J. Xuzhou Norm. Univ. (Nat. Sci. Edn.), 2009, 27, 2, 88-90. [all data]