Benzene, 1-chloro-4-(1-methylethyl)-
- Formula: C9H11Cl
- Molecular weight: 154.637
- IUPAC Standard InChIKey: FHBSIIZALGOVLM-UHFFFAOYSA-N
- CAS Registry Number: 2621-46-7
- Chemical structure:
View 3d structure (requires JavaScript / HTML 5) - Other names: Cumene, p-chloro-; p-Chlorocumene; 2-(p-Chlorophenyl)propane; 4-Chloroisopropylbenzene; 1-Chloro-4-isopropylbenzene; 4-chlorocumene

Condensed phase thermochemistry data

Data compiled by: Hussein Y. Afeefy, Joel F. Liebman, and Stephen E. Stein
Quantity | Value | Units | Method | Reference | Comment |
---|---|---|---|---|---|
ΔfH°liquid | -77.9 ± 1.8 | kJ/mol | Eqk | Nesterova, Rozhnov, et al., 1985 |

Phase change data

Data compiled as indicated in comments:
BS - Robert L. Brown and Stephen E. Stein
TRC - Thermodynamics Research Center, NIST Boulder Laboratories, Chris Muzny director
AC - William E. Acree, Jr., James S. Chickos
Quantity | Value | Units | Method | Reference | Comment |
---|---|---|---|---|---|
Tboil | 471.5 | K | N/A | Weast and Grasselli, 1989 | BS |
Tboil | 466. | K | N/A | Roberts and Good, 1951 | Uncertainty assigned by TRC = 4. K; TRC |
Tboil | 463. | K | N/A | Roberts and Good, 1951 | Uncertainty assigned by TRC = 4. K; TRC |
Enthalpy of vaporization
ΔvapH (kJ/mol) | Temperature (K) | Method | Reference | Comment |
---|---|---|---|---|
51.4 | 322. | N/A | Dykyj, Svoboda, et al., 1999 | Based on data from 307. to 472. K.; AC |
48.5 | 383. | A | Stephenson and Malanowski, 1987 | Based on data from 368. to 513. K. See also Dykyj and Vanko, 1970.; AC |

Reaction thermochemistry data

Data compiled by: Hussein Y. Afeefy, Joel F. Liebman, and Stephen E. Stein
Individual Reactions
By formula: C6H5Cl + C12H17Cl = C9H11Cl + C9H11Cl
Quantity | Value | Units | Method | Reference | Comment |
---|---|---|---|---|---|
ΔrH° | -0.84 ± 0.42 | kJ/mol | Eqk | Nesterova, Rozhnov, et al., 1985 | liquid phase |
By formula: C9H11Cl = C9H11Cl
Quantity | Value | Units | Method | Reference | Comment |
---|---|---|---|---|---|
ΔrH° | -2.51 ± 0.84 | kJ/mol | Eqk | Nesterova, Rozhnov, et al., 1985 | liquid phase |

Normal alkane RI, non-polar column, temperature ramp

Column type | Active phase | I | Reference | Comment |
---|---|---|---|---|
Capillary | OV-101 | 1080. | Zenkevich, 2001 | N2, 4. K/min; Column length: 25. m; Column diameter: 0.20 mm; Tstart: 60. C; Tend: 240. C |

References

Nesterova, Rozhnov, et al., 1985
Nesterova, T.N.; Rozhnov, A.M.; Malova, T.N.; Kovzel, E.N.,
Molar enthalpies of formation of isopropylchlorobenzenes derived from equilibrium measurements,
J. Chem. Thermodyn., 1985, 17, 649-656. [all data]
Weast and Grasselli, 1989
CRC Handbook of Data on Organic Compounds, 2nd Editon, Weast,R.C and Grasselli, J.G., ed(s)., CRC Press, Inc., Boca Raton, FL, 1989, 1. [all data]
Roberts and Good, 1951
Roberts, R.M.; Good, G.M.,
Effect of Nuclear Substitution on the Rate of SIlica-Zirconia-Alumina- Catalyzed Depropylation of Cumene,
J. Am. Chem. Soc., 1951, 73, 1320. [all data]
Dykyj, Svoboda, et al., 1999
Dykyj, J.; Svoboda, J.; Wilhoit, R.C.; Frenkel, M.L.; Hall, K.R.,
Vapor Pressure of Chemicals: Part A. Vapor Pressure and Antoine Constants for Hydrocarbons and Sulfur, Selenium, Tellurium and Hydrogen Containing Organic Compounds, Springer, Berlin, 1999, 373. [all data]
Stephenson and Malanowski, 1987
Stephenson, Richard M.; Malanowski, Stanislaw,
Handbook of the Thermodynamics of Organic Compounds, 1987, https://doi.org/10.1007/978-94-009-3173-2
. [all data]
Dykyj and Vanko, 1970
Dykyj, J.; Vanko, A.,
Petrochemica, 1970, 10, 1, 3. [all data]
Zenkevich, 2001
Zenkevich, I.G.,
Interpretation of Gas Chromatographic Retention Indices in estimation of Structures of Isomeric Products of Radical Chlorinating of Alkyl Arenes,
Zh. Org. Khim., 2001, 37, 2, 283-293. [all data]