Difluoroborane anion
- Formula: BF2-
- Molecular weight: 48.808
- CAS Registry Number: 26202-31-3

Gas phase thermochemistry data

Data compiled as indicated in comments:
B - John E. Bartmess
Quantity | Value | Units | Method | Reference | Comment |
---|---|---|---|---|---|
ΔfH°gas | -705. ± 16. | kJ/mol | R-EA | Srivastava, Uy, et al., 1974 | EA: 29.2 kcal < EA(F), new EA(F) used. Too stable by ca. 24 kcal/mol, relative to G3(MP2)B3 calcs.; B |
Quantity | Value | Units | Method | Reference | Comment |
S°gas,1 bar | 240.74 | J/mol*K | Review | Chase, 1998 | Data last reviewed in June, 1972 |

Gas phase ion energetics data

Data compiled by: John E. Bartmess
Protonation reactions
Quantity | Value | Units | Method | Reference | Comment |
---|---|---|---|---|---|
ΔrH° | 1564. ± 26. | kJ/mol | D-EA | Srivastava, Uy, et al., 1974 | gas phase; EA: 29.2 kcal < EA(F), new EA(F) used. Too stable by ca. 24 kcal/mol, relative to G3(MP2)B3 calcs. |
Quantity | Value | Units | Method | Reference | Comment |
ΔrG° | 1533. ± 26. | kJ/mol | H-TS | Srivastava, Uy, et al., 1974 | gas phase; EA: 29.2 kcal < EA(F), new EA(F) used. Too stable by ca. 24 kcal/mol, relative to G3(MP2)B3 calcs. |

Reaction thermochemistry data

Data compiled by: John E. Bartmess
Individual Reactions
Quantity | Value | Units | Method | Reference | Comment |
---|---|---|---|---|---|
ΔrH° | 373.9 ± 6.1 | kcal/mol | D-EA | Srivastava, Uy, et al., 1974 | gas phase; EA: 29.2 kcal < EA(F), new EA(F) used. Too stable by ca. 24 kcal/mol, relative to G3(MP2)B3 calcs. |
Quantity | Value | Units | Method | Reference | Comment |
ΔrG° | 366.4 ± 6.2 | kcal/mol | H-TS | Srivastava, Uy, et al., 1974 | gas phase; EA: 29.2 kcal < EA(F), new EA(F) used. Too stable by ca. 24 kcal/mol, relative to G3(MP2)B3 calcs. |

References

Srivastava, Uy, et al., 1974
Srivastava, R.D.; Uy, O.M.; Farber, M.,
Experimental determination of heats of formation of negative ions and electron affinities of several boron and aluminum fluorides,
J. Chem. Soc. Faraday Trans. 1, 1974, 70, 1033. [all data]
Chase, 1998
Chase, M.W., Jr.,
NIST-JANAF Themochemical Tables, Fourth Edition,
J. Phys. Chem. Ref. Data, Monograph 9, 1998, 1-1951. [all data]