2-Furanmethanol, tetrahydro-α,α,5-trimethyl-5-(4-methyl-3-cyclohexen-1-yl)-, [2S-[2α,5β(R*)]]-
- Formula: C15H26O2
- Molecular weight: 238.3657
- IUPAC Standard InChIKey: RKBAYVATPNYHLW-MHEXWIEDSA-N
- CAS Registry Number: 26184-88-3
- Chemical structure:
View 3d structure (requires JavaScript / HTML 5) - Stereoisomers:
- Other names: 2-((2S,5S)-5-Methyl-5-((S)-4-methylcyclohex-3-en-1-yl)tetrahydrofuran-2-yl)propan-2-ol; α-Bisabolol oxide B; Bisabolol oxide II; 2-Furanmethanol, tetrahydro-α,α,5-trimethyl-5-(4-methyl-3-cyclohexen-1-yl)-; 2-Furanmethanol, tetrahydro-α,α,5-trimethyl-5-(4-methyl-3-cyclohexen-1-yl)-, [2S-[2α,5β(R)]]-; (-)-Bisabolol oxide B; (-)-α-Bisabolol oxide B; [2S-[2α,5β(R*)]]-tetrahydro-α,α,5-trimethyl-5-(4-methyl-3-cyclohexen-1-yl)furan-2-methanol

Van Den Dool and Kratz RI, non-polar column, temperature ramp

Column type | Active phase | I | Reference | Comment |
---|---|---|---|---|
Capillary | HP-5MS | 1658. | Saroglou, Arfan, et al., 2007 | 30. m/0.25 mm/0.25 μm, He, 60. C @ 5. min, 4. K/min; Tend: 280. C |
Capillary | ZB-5 | 1655. | Simoniatto, Bonani, et al., 2007 | 30. m/0.25 mm/0.25 μm, He, 3. K/min; Tstart: 50. C; Tend: 250. C |
Capillary | HP-5 | 1652. | Couladis, Tsortanidou, et al., 2001 | 30. m/0.25 mm/0.25 μm, He, 3. K/min; Tstart: 60. C; Tend: 380. C |

Normal alkane RI, non-polar column, temperature ramp

Column type | Active phase | I | Reference | Comment |
---|---|---|---|---|
Capillary | SE-54 | 1676. | Buono-Core, Nunez, et al., 2011 | 30. m/0.25 mm/0.25 μm, Helium, 80. C @ 2. min, 10. K/min, 250. C @ 10. min |
Capillary | HP-5 | 1652. | Pavlovic, Petrovic, et al., 2007 | 25. m/0.32 mm/0.52 μm, Helium, 4. K/min; Tstart: 40. C; Tend: 280. C |
Capillary | HP-5 MS | 1658. | Vagionas, Graikou, et al., 2007 | 30. m/0.25 mm/0.25 μm, Helium, 3. K/min; Tstart: 60. C; Tend: 280. C |
Capillary | DB-5 | 1646. | Apel, Sobral, et al., 2006 | 30. m/0.25 mm/0.25 μm, He, 3. K/min; Tstart: 60. C; Tend: 300. C |
Capillary | HP-5MS | 1658. | Petrakis, Roussis, et al., 2005 | 3. K/min; Column length: 30. m; Column diameter: 0.2 mm; Tstart: 60. C; Tend: 280. C |
Capillary | HP-5 | 1647. | Utsunomia, Kawata, et al., 2005 | 30. m/0.32 mm/0.25 μm, Helium, 4. K/min, 300. C @ 5. min; Tstart: 40. C |
Capillary | DB-5 | 1654. | Senatore, Rigano, et al., 2004 | 30. m/0.25 mm/0.25 μm, He, 40. C @ 5. min, 2. K/min, 250. C @ 20. min |
Capillary | DB-5 | 1656. | Masotti, Juteau, et al., 2003 | 50. m/0.2 mm/0.25 μm, He, 50. C @ 2. min, 3. K/min; Tend: 220. C |
Capillary | BP-1 | 1644. | Das, Ram, et al., 2002 | 25. m/0.50 mm/0.25 μm, N2, 5. K/min, 220. C @ 10. min; Tstart: 60. C |

Normal alkane RI, non-polar column, custom temperature program

Column type | Active phase | I | Reference | Comment |
---|---|---|---|---|
Capillary | Optima-5MS | 1649. | HEuskin, Godin, et al., 2009 | 30. m/0.32 mm/0.25 μm, Helium; Program: 40 0C (5 min) 5 0C/min -> 230 0C 30 0C/min -> 280 0C (5 min) |
Capillary | HP-5 | 1663. | Zhao, Li, et al., 2008 | 30. m/0.25 mm/0.25 μm; Program: 40 0C (2 min) 5 0C/min -> 80 0C 7 oC/min -> 160 0C 9 0C/min -> 200 0C 20 0C/min -> 280 0C (10 min) |
Capillary | HP-5 | 1652. | Zhao, Li, et al., 2008 | 30. m/0.25 mm/0.25 μm; Program: not specified |
Capillary | HP-5 | 1658. | Pavlovic, Petrovic, et al., 2007 | 25. m/0.32 mm/0.52 μm, Helium; Program: not specified |

Normal alkane RI, polar column, custom temperature program

Column type | Active phase | I | Reference | Comment |
---|---|---|---|---|
Capillary | HP Innowax FSP | 2156. | Tabanca N., Demirci B., et al., 2007 | 60. m/0.25 mm/0.25 μm, N2; Program: 60C(10min) => 4C/min => 220C(10min) => 1C/min => 240C |
Capillary | Innowax FSC | 2163. | Iscan, Kirimer, et al., 2006 | 60. m/0.25 mm/0.25 μm, N2; Program: 60C(10min) => 4C/min => 220C(10min) => 1C/min => 240C |
Capillary | HP-Innowax FSC | 2156. | Suleimenov Y.M., Atazhanova G.A., et al., 2006 | 60. m/0.25 mm/0.25 μm, He; Program: 60(10min) => 4C/min => 220C(10min) => 1C/min => 240C |
Capillary | HP-Innowax FSC | 2157. | Tabanca, Kirimer, et al., 2001 | 60. m/0.25 mm/0.25 μm; Program: 60C(10min) => 4C/min => 220C(10min) => 1C/min => 240C |
Capillary | Innowax | 2157. | Baser, Kürkcüoglu, et al., 1998 | 60. m/0.25 mm/0.25 μm; Program: 60C(10min) => 4C/min => 220C(10min) => 1C/min => 240C |

References

Saroglou, Arfan, et al., 2007
Saroglou, V.; Arfan, M.; Shabir, A.; Hadjipavlou-Litina, D.; Skaltsa, H.,
Composition and antioxidant activity of the essential oil of Teucrium royleanum Wall. ex Benth growing in Pakistan,
Flavour Fragr. J., 2007, 22, 2, 154-157, https://doi.org/10.1002/ffj.1774
. [all data]
Simoniatto, Bonani, et al., 2007
Simoniatto, E.; Bonani, V.F.L.; Morel, A.F.; Poppi, N.R.; Raposo, J.L., Jr.; Stuker, C.Z.; Peruzzo, G.M.; Peres, M.T.L.P.; Hess, S.C.,
Chemical composition and evaluation of antibacterial and antioxidant activities of the essential oil of Croton urucurana Baillon (Euphorbiaceae) stem bark,
J. Braz. Chem., 2007, 18, 5, 879-885, https://doi.org/10.1590/S0103-50532007000500002
. [all data]
Couladis, Tsortanidou, et al., 2001
Couladis, M.; Tsortanidou, V.; Francisco-Ortega, J.; Santos-Guerra, A.; Harvala, C.,
Composition of the essential oils of Argyranthemum species growing in the Canary Islands,
Flavour Fragr. J., 2001, 16, 2, 103-106, https://doi.org/10.1002/ffj.954
. [all data]
Buono-Core, Nunez, et al., 2011
Buono-Core, G.E.; Nunez, M.V.; Lucero, A.; Vargas, R.; Jullian, C.,
Structural elucidation of bioactive principles in floral extracts of German chamomille (Matricaria recituta L.),
J. Chil. Chem. Soc., 2011, 56, 1, 549-553, https://doi.org/10.4067/S0717-97072011000100006
. [all data]
Pavlovic, Petrovic, et al., 2007
Pavlovic, M.; Petrovic, S.; Ristic, M.; Maksimovic, Z.; Kovacevic, N.,
Essential oil of filipendula hexapetala,
Chem. Natural Compounds, 2007, 43, 2, 228-229, https://doi.org/10.1007/s10600-007-0088-z
. [all data]
Vagionas, Graikou, et al., 2007
Vagionas, K.; Graikou, K.; Ngassapa, O.; Runyoro, D.; Chinou, I.,
Composition and antimicrobial activity of the essential oils of three Satureja species growing in Tansania,
Food Chem., 2007, 103, 2, 319-324, https://doi.org/10.1016/j.foodchem.2006.07.051
. [all data]
Apel, Sobral, et al., 2006
Apel, M.A.; Sobral, M.; Zuanazzi, J.A.S.; Henriques, A.T.,
Essential oil composition of four Plinia species (Myrtaceae),
Flavour Fragr. J., 2006, 21, 3, 565-567, https://doi.org/10.1002/ffj.1638
. [all data]
Petrakis, Roussis, et al., 2005
Petrakis, P.V.; Roussis, V.; Papadimitriou, D.; Vagias, C.; Tsitsimpikou, C.,
The effect of terpenoid extracts from 15 pine species on the feeding behavioural sequence of the late instars of the pine processionary caterpillar Thaumetopoea pityocampa,
Behav. Processes, 2005, 69, 3, 303-322, https://doi.org/10.1016/j.beproc.2004.12.008
. [all data]
Utsunomia, Kawata, et al., 2005
Utsunomia, H.; Kawata, J.; Chanoki, W.; Shirakawa, N.; Miyazawa, M.,
Components of Essential Oil from Woods of Prunus mume Sieb. at Zucc.,
J. Oleo Sci., 2005, 54, 11, 609-612, https://doi.org/10.5650/jos.54.609
. [all data]
Senatore, Rigano, et al., 2004
Senatore, F.; Rigano, D.; de Fusco, R.; Bruno, M.,
Composition of the essential oil from flowerheads of Chrysanthemum coronarium L. (Asteraceae) growing wild in Southern Italy,
Flavour Fragr. J., 2004, 19, 2, 149-152, https://doi.org/10.1002/ffj.1285
. [all data]
Masotti, Juteau, et al., 2003
Masotti, V.; Juteau, F.; Bessière, J.M.; Viano, J.,
Seasonal and phenological variations of the essential oil from the narrow endemic species Artemisia molinieri and its biological activities,
J. Agric. Food Chem., 2003, 51, 24, 7115-7121, https://doi.org/10.1021/jf034621y
. [all data]
Das, Ram, et al., 2002
Das, M.; Ram, G.; Singh, A.; Mallavarapu, G.R.; Ramesh, S.; Ram, M.; Kumar, S.,
Volatile constituents of different plant parts of Chamomilla recutita L. Rausch grown in the Indo-Gangetic plains,
Flavour Fragr. J., 2002, 17, 1, 9-12, https://doi.org/10.1002/ffj.1035
. [all data]
HEuskin, Godin, et al., 2009
HEuskin, S.; Godin, B.; Leroy, P.; Quentin C.; Wathelet, J.-P.; Verheggen, F.; Haubruge, E.; Lognay, G.,
Fast gas chromatography characterization of purified semiochemicals from essential oils of Matricaria chamomilla L. (Asteraceae) and Nepeta cataria L. (Lamiaceae),
J. Chromatorg. A., 2009, 1216, 14, 2768-2775, https://doi.org/10.1016/j.chroma.2008.09.109
. [all data]
Zhao, Li, et al., 2008
Zhao, Y.; Li, J.; Xu, Y.; Duan, H.; Fan, W.; Zhao, G.,
EXtraction, preparation and identification of volatile compounds in Changyu XO brandy,
Chinese J. Chromatogr., 2008, 26, 2, 212-222, https://doi.org/10.1016/S1872-2059(08)60014-0
. [all data]
Tabanca N., Demirci B., et al., 2007
Tabanca N.; Demirci B.; Crockett S.L.; Baser K.H.C.; Wedge D.E.,
Chemical composition and antifungal activity of Arnica longifolia, Aster hesperius, and Chrysothamnus nauseosus essential oils,
J. Agric. Food Chem., 2007, 55, 21, 8430-8435, https://doi.org/10.1021/jf071379c
. [all data]
Iscan, Kirimer, et al., 2006
Iscan, G.; Kirimer, N.; Kurkcuoglu, M.; Arabaci, T.; Kupeli, E.; Baser, K.H.C.,
Biological Activity and Composition of the Essential Oils of Achillea schischkinii Sosn. and Achillea aleppica DC. subsp. aleppica,
J. Agric. Food Chem., 2006, 54, 1, 170-173, https://doi.org/10.1021/jf051644z
. [all data]
Suleimenov Y.M., Atazhanova G.A., et al., 2006
Suleimenov Y.M.; Atazhanova G.A.; Ozek T.; Demirci B.; Kulyyasov A.T.; Adekenov S.M.; Baser K.H.C.,
Essential oil composition of three species of Achillea from Kazakhstan,
Chem. Nat. Compd. (Engl. Transl.), 2006, 37, 5, 447-450, https://doi.org/10.1023/A:1014471326724
. [all data]
Tabanca, Kirimer, et al., 2001
Tabanca, N.; Kirimer, N.; Can Baser, K.H.,
The composition of essential oils from two varieties of Sideritis erythrantha var. erythrantha and var. cedretorum,
Turk. J. Chem., 2001, 25, 201-208. [all data]
Baser, Kürkcüoglu, et al., 1998
Baser, K.H.C.; Kürkcüoglu, M.; Aytac, Z.,
Composition of the essential oil of Salvia euphratica Montbret ex Bentham var. euphratica from Turkey,
Flavour Fragr. J., 1998, 13, 1, 63-64, https://doi.org/10.1002/(SICI)1099-1026(199801/02)13:1<63::AID-FFJ694>3.0.CO;2-Z
. [all data]