Naproxen methyl ester
- Formula: C15H16O3
- Molecular weight: 244.2857
- IUPAC Standard InChIKey: ZFYFBPCRUQZGJE-UHFFFAOYSA-N
- CAS Registry Number: 26159-35-3
- Chemical structure:
View 3d structure (requires JavaScript / HTML 5) - Other names: 2-Naphthaleneacetic acid, 6-methoxy-α-methyl-, methyl ester, (+)-; Methyl 2-(6-methoxy-2-naphthyl)propanoate, (S)-; Naproxen, methylated; Naproxen, methyl deriv.; (+)-Naproxen methyl ester; 2-naphthaleneacetic acid, 6-methoxy, a-methyl, methyl ester

Van Den Dool and Kratz RI, non-polar column, temperature ramp

Column type | Active phase | I | Reference | Comment |
---|---|---|---|---|
Capillary | DB-1 | 1965. | Johnson, Urso, et al., 1997 | 30. m/0.2 mm/0.25 μm, 50. C @ 2. min, 5. K/min, 300. C @ 5. min |
Capillary | DB-1 | 1965. | Johnson, Urso, et al., 1997 | 30. m/0.2 mm/0.25 μm, 50. C @ 2. min, 5. K/min, 300. C @ 5. min |

Lee's RI, non-polar column, temperature ramp

Column type | Active phase | I | Reference | Comment |
---|---|---|---|---|
Capillary | DB-1 | 340.3 | Johnson, Urso, et al., 1997 | 30. m/0.2 mm/0.25 μm, 50. C @ 2. min, 5. K/min, 300. C @ 5. min |
Capillary | DB-1 | 340.3 | Johnson, Urso, et al., 1997 | 30. m/0.2 mm/0.25 μm, 50. C @ 2. min, 5. K/min, 300. C @ 5. min |

References

Johnson, Urso, et al., 1997
Johnson, C.I.; Urso, A.; Geleta, L.,
Broad spectrum analysis of municipal and industrial effluents discharged into the Peace, Athabasca and Slave river basins: characterization of effluent samples, 1994 - Volume 1 of 2, Northern River Basins Study Project Report No. 121, Norther River Basins Study, Edmonton, Alberta, 1997, 27. [all data]