Hexaethylene glycol
- Formula: C12H26O7
- Molecular weight: 282.3306
- IUPAC Standard InChIKey: IIRDTKBZINWQAW-UHFFFAOYSA-N
- CAS Registry Number: 2615-15-8
- Chemical structure:
View 3d structure (requires JavaScript / HTML 5) - Other names: Hexagol; 3,6,9,12,15-Pentaoxaheptadecane-1,17-diol; Ethanol, 2,2'-(oxybis(ethyleneoxyethyleneoxy))di-; Ethanol, 2,2'-(oxybis(oxy-2,1-ethanediyloxy-2,1-ethanediyloxy))bis-; Hexaoxyethylene glycol; 2-[2-[2-[2-[2-(2-Hydroxyethoxy)ethoxy]ethoxy]ethoxy]ethoxy]ethanol; Polyoxyethylene (6); Polyethylene glycol 300; PEG-6; NSC 201209

Condensed phase thermochemistry data

Data compiled by: Eugene S. Domalski and Elizabeth D. Hearing
Constant pressure heat capacity of liquid
Cp,liquid (J/mol*K) | Temperature (K) | Reference | Comment |
---|---|---|---|
620.0 | 298. | Zaripov, 1982 | T = 298, 323, 363 K. |

Phase change data

Data compiled by: Thermodynamics Research Center, NIST Boulder Laboratories, Chris Muzny director
Quantity | Value | Units | Method | Reference | Comment |
---|---|---|---|---|---|
Tfus | 274.45 | K | N/A | Gallaugher and Hibbert, 1936 | Uncertainty assigned by TRC = 0.7 K |

Van Den Dool and Kratz RI, non-polar column, temperature ramp

Column type | Active phase | I | Reference | Comment |
---|---|---|---|---|
Capillary | Ultra-2 | 2078. | Poskrobko, Linkiewicz, et al., 1994 | 25. m/0.32 mm/0.52 μm, H2, 8. K/min; Tstart: 50. C; Tend: 310. C |

Van Den Dool and Kratz RI, non-polar column, custom temperature program

Column type | Active phase | I | Reference | Comment |
---|---|---|---|---|
Capillary | VF-5MS | 2081.8 | Zheng and White, 2008 | 30. m/0.25 mm/0.25 μm, He; Program: not specified |

References

Zaripov, 1982
Zaripov, Z.I.,
Experimental study of the isobaric heat capacity of liquid organic compounds with molecular weights of up to 4000 a.e.m., 1982, Teplomassoobmen Teplofiz. [all data]
Gallaugher and Hibbert, 1936
Gallaugher, A.F.; Hibbert, H.,
Studies on reactions relating to carbohydrates and polysaccharides: xlix molecular weight, molar refraction, freezing point and other properties of the polyethylene glycols and their derivatives,
J. Am. Chem. Soc., 1936, 58, 813. [all data]
Poskrobko, Linkiewicz, et al., 1994
Poskrobko, J.; Linkiewicz, M.; Jaworski, M.,
Analysis of high-boiling ethoxylates of methyl, ethyl and butyl alcohols, with the use of gas chromatography,
Chem. Anal. (Warsaw), 1994, 39, 2, 153-159. [all data]
Zheng and White, 2008
Zheng, Y.; White, E.,
Retention Data. NIST Mass Spectrometry Data Center., NIST Mass Spectrometry Data Center, 2008. [all data]