Cyclopentane, 1,2,4-trimethyl-, (1α,2α,4α)-
- Formula: C8H16
- Molecular weight: 112.2126
- IUPAC Standard InChIKey: PNUFYSGVPVMNRN-RNLVFQAGSA-N
- CAS Registry Number: 2613-72-1
- Chemical structure:
View 3d structure (requires JavaScript / HTML 5) - Species with the same structure:
- Stereoisomers:
- Other names: 1-cis-2-cis-4-Trimethylcyclopentane; 1,cis-3,cis-4-trimethylcyclopentane; (1α,2α,4α)-1,2,4-trimethylcyclopentane

Phase change data

Data compiled by: Thermodynamics Research Center, NIST Boulder Laboratories, Chris Muzny director
Quantity | Value | Units | Method | Reference | Comment |
---|---|---|---|---|---|
Tboil | 389.90 | K | N/A | Anonymous, 1963 | Uncertainty assigned by TRC = 0.2 K |
Tboil | 390.10 | K | N/A | Desty and Whyman, 1957 | Uncertainty assigned by TRC = 2. K; identification of stereoisome not certain |
Tboil | 391. | K | N/A | Glasgow, Gordon, et al., 1957 | Uncertainty assigned by TRC = 2. K |
Quantity | Value | Units | Method | Reference | Comment |
Tfus | 140.83 | K | N/A | Anonymous, 1963 | Uncertainty assigned by TRC = 0.15 K |

Kovats' RI, non-polar column, isothermal

Column type | Active phase | Temperature (C) | I | Reference | Comment |
---|---|---|---|---|---|
Capillary | Squalane | 50. | 779.5 | Lunskii and Paizanskaya, 1988 | He; Column length: 50. m; Column diameter: 0.22 mm |
Capillary | Squalane | 50. | 819.4 | Lunskii and Paizanskaya, 1988 | He; Column length: 50. m; Column diameter: 0.22 mm |
Capillary | Squalane | 70. | 783.9 | Lunskii and Paizanskaya, 1988 | He; Column length: 50. m; Column diameter: 0.22 mm |
Capillary | Squalane | 70. | 820.1 | Lunskii and Paizanskaya, 1988 | He; Column length: 50. m; Column diameter: 0.22 mm |
Capillary | Vacuum Grease Oil (VM-4) | 35. | 775. | Sidorov, Petrova, et al., 1972 | |
Capillary | Vacuum Grease Oil (VM-4) | 45. | 778. | Sidorov, Petrova, et al., 1972 | |
Capillary | Vacuum Grease Oil (VM-4) | 50. | 780. | Sidorov, Petrova, et al., 1972 | |
Capillary | Vacuum Grease Oil (VM-4) | 58. | 782. | Sidorov, Petrova, et al., 1972 | |
Capillary | Vacuum Grease Oil (VM-4) | 68. | 786. | Sidorov, Petrova, et al., 1972 | |
Packed | Vacuum Grease Oil (VM-4) | 35. | 775. | Sidorov, Ivanova, et al., 1971 | |
Packed | SE-30 | 130. | 797. | Mitra and Saha, 1970 | N2, Chromosorb W; Column length: 6.1 m |

Kovats' RI, non-polar column, custom temperature program

Column type | Active phase | I | Reference | Comment |
---|---|---|---|---|
Capillary | Petrocol DH-100 | 768.75 | Haagen-Smit Laboratory, 1997 | He; Column length: 100. m; Column diameter: 0.2 mm; Program: 5C(10min) => 5C/min => 50C(48min) => 1.5C/min => 195C(91min) |

Van Den Dool and Kratz RI, non-polar column, temperature ramp

Column type | Active phase | I | Reference | Comment |
---|---|---|---|---|
Capillary | OV-101 | 772.1 | Yin, Liu, et al., 2001 | N2, 1. K/min; Column length: 80. m; Column diameter: 0.22 mm; Tstart: 30. C; Tend: 130. C |

Normal alkane RI, non-polar column, isothermal

Column type | Active phase | Temperature (C) | I | Reference | Comment |
---|---|---|---|---|---|
Capillary | Squalane | 100. | 797. | Krupcik, Cellar, et al., 1986 | Column length: 180. m; Column diameter: 0.25 mm |
Capillary | Squalane | 40. | 786. | Krupcik, Cellar, et al., 1986 | Column length: 180. m; Column diameter: 0.25 mm |
Capillary | Squalane | 70. | 791. | Krupcik, Cellar, et al., 1986 | Column length: 180. m; Column diameter: 0.25 mm |

Normal alkane RI, non-polar column, temperature ramp

Column type | Active phase | I | Reference | Comment |
---|---|---|---|---|
Capillary | Squalane | 775.5 | Krupcik, Cellar, et al., 1986, 2 | 0.2 K/min; Column length: 100. m; Column diameter: 0.25 mm |
Capillary | Squalane | 777.7 | Krupcik, Cellar, et al., 1986, 2 | 0.4 K/min; Column length: 100. m; Column diameter: 0.25 mm |
Capillary | Squalane | 779.5 | Krupcik, Cellar, et al., 1986, 2 | 0.6 K/min; Column length: 100. m; Column diameter: 0.25 mm |
Capillary | Squalane | 781.0 | Krupcik, Cellar, et al., 1986, 2 | 0.8 K/min; Column length: 100. m; Column diameter: 0.25 mm |
Capillary | Squalane | 782.2 | Krupcik, Cellar, et al., 1986, 2 | 1. K/min; Column length: 100. m; Column diameter: 0.25 mm |
Capillary | Squalane | 788. | Krupcik, Cellar, et al., 1986 | 0.1 K/min; Column length: 180. m; Column diameter: 0.25 mm; Tstart: 40. C |
Capillary | Squalane | 789. | Krupcik, Cellar, et al., 1986 | 0.2 K/min; Column length: 180. m; Column diameter: 0.25 mm; Tstart: 40. C |
Capillary | Squalane | 791. | Krupcik, Cellar, et al., 1986 | 0.4 K/min; Column length: 180. m; Column diameter: 0.25 mm; Tstart: 40. C |
Capillary | Squalane | 792. | Krupcik, Cellar, et al., 1986 | 0.6 K/min; Column length: 180. m; Column diameter: 0.25 mm; Tstart: 40. C |
Capillary | Squalane | 794. | Krupcik, Cellar, et al., 1986 | 0.8 K/min; Column length: 180. m; Column diameter: 0.25 mm; Tstart: 40. C |
Capillary | Squalane | 794. | Krupcik, Cellar, et al., 1986 | 1.0 K/min; Column length: 180. m; Column diameter: 0.25 mm; Tstart: 40. C |

Normal alkane RI, non-polar column, custom temperature program

Column type | Active phase | I | Reference | Comment |
---|---|---|---|---|
Capillary | Methyl Silicone | 769. | Spieksma, 1999 | Program: not specified |

References

Anonymous, 1963
Anonymous, R.,
, E. I. Du Pont, 1963. [all data]
Desty and Whyman, 1957
Desty, D.H.; Whyman, B.H.F.,
Anal. Chem., 1957, 29, 320. [all data]
Glasgow, Gordon, et al., 1957
Glasgow, A.R.; Gordon, R.J.; Willingham, C.B.; Mair, B.J.; Rossini, F.D.,
Hydrocarbons in the 116 deg C to 126 deg C Fraction of Petroleum,
Anal. Chem., 1957, 29, 357. [all data]