Cyclopentane, 1,2,3-trimethyl-, (1α,2α,3α)-
- Formula: C8H16
- Molecular weight: 112.2126
- IUPAC Standard InChIKey: VCWNHOPGKQCXIQ-RNLVFQAGSA-N
- CAS Registry Number: 2613-69-6
- Chemical structure:
View 3d structure (requires JavaScript / HTML 5) - Species with the same structure:
- Stereoisomers:
- Other names: Cyclopentane, 1,2,3-trimethyl-, cis-1,2,cis-1,3-; 1,2,3-Trimethylcyclopentane, cis, cis; 1,cis-2,cis-3-Trimethylcyclopentane; 1,2,3-Trimethylcyclopentane, (Z,Z)-; 1,2(cis),3(cis)-trimethylcyclopentane

Phase change data

Data compiled as indicated in comments:
BS - Robert L. Brown and Stephen E. Stein
TRC - Thermodynamics Research Center, NIST Boulder Laboratories, Chris Muzny director
Quantity | Value | Units | Method | Reference | Comment |
---|---|---|---|---|---|
Tboil | 395.6 ± 0.8 | K | AVG | N/A | Average of 6 values; Individual data points |
Quantity | Value | Units | Method | Reference | Comment |
Tfus | 156.670 | K | N/A | Streiff, Zimmerman, et al., 1948 | Uncertainty assigned by TRC = 0.07 K; TRC |
Tfus | 156.690 | K | N/A | Streiff, Zimmerman, et al., 1948 | Uncertainty assigned by TRC = 0.05 K; TRC |
Tfus | 156.720 | K | N/A | Streiff, Zimmerman, et al., 1948 | Uncertainty assigned by TRC = 0.03 K; TRC |
Tfus | 156.450 | K | N/A | Streiff, Murphy, et al., 1946 | Uncertainty assigned by TRC = 0.2 K; TRC |

Kovats' RI, non-polar column, isothermal

Column type | Active phase | Temperature (C) | I | Reference | Comment |
---|---|---|---|---|---|
Capillary | Squalane | 50. | 802.3 | Krupcik, Cellar, et al., 1986 | Column length: 180. m; Column diameter: 0.25 mm |
Capillary | DB-1 | 60. | 802.7 | Lubeck and Sutton, 1983 | Column length: 60. m; Column diameter: 0.264 mm |
Capillary | DB-1 | 60. | 803. | Lubeck and Sutton, 1983 | 60. m/0.259 mm/1. μm |
Capillary | Squalane | 100. | 783. | Lulova, Leont'eva, et al., 1976 | He; Column length: 120. m; Column diameter: 0.25 mm |
Capillary | Squalane | 100. | 783. | Lulova, Leont'eva, et al., 1976 | He; Column length: 120. m; Column diameter: 0.25 mm |
Capillary | SE-30 | 130. | 822. | Mitra, Mohan, et al., 1974 | H2; Column length: 6.1 m; Column diameter: 3.18 mm |
Capillary | SE-30 | 150. | 829. | Mitra, Mohan, et al., 1974 | H2; Column length: 6.1 m; Column diameter: 3.18 mm |
Capillary | SE-30 | 160. | 833. | Mitra, Mohan, et al., 1974 | H2; Column length: 6.1 m; Column diameter: 3.18 mm |
Capillary | SE-30 | 170. | 836. | Mitra, Mohan, et al., 1974 | H2; Column length: 6.1 m; Column diameter: 3.18 mm |
Capillary | Squalane | 50. | 802. | Rijks and Cramers, 1974 | N2; Column length: 100. m; Column diameter: 0.25 mm |
Capillary | Squalane | 70. | 808. | Rijks and Cramers, 1974 | N2; Column length: 100. m; Column diameter: 0.25 mm |
Capillary | Vacuum Grease Oil (VM-4) | 35. | 797. | Sidorov, Petrova, et al., 1972 | |
Capillary | Vacuum Grease Oil (VM-4) | 45. | 801. | Sidorov, Petrova, et al., 1972 | |
Capillary | Vacuum Grease Oil (VM-4) | 50. | 803. | Sidorov, Petrova, et al., 1972 | |
Capillary | Vacuum Grease Oil (VM-4) | 58. | 806. | Sidorov, Petrova, et al., 1972 | |
Capillary | Vacuum Grease Oil (VM-4) | 68. | 809. | Sidorov, Petrova, et al., 1972 | |
Packed | Vacuum Grease Oil (VM-4) | 35. | 797. | Sidorov, Ivanova, et al., 1971 | |
Packed | SE-30 | 130. | 821. | Mitra and Saha, 1970 | N2, Chromosorb W; Column length: 6.1 m |

Kovats' RI, non-polar column, custom temperature program

Column type | Active phase | I | Reference | Comment |
---|---|---|---|---|
Capillary | Petrocol DH-100 | 797.2 | Haagen-Smit Laboratory, 1997 | He; Column length: 100. m; Column diameter: 0.2 mm; Program: 5C(10min) => 5C/min => 50C(48min) => 1.5C/min => 195C(91min) |

Van Den Dool and Kratz RI, non-polar column, temperature ramp

Column type | Active phase | I | Reference | Comment |
---|---|---|---|---|
Capillary | Petrocol DH | 801.4 | Censullo, Jones, et al., 2003 | 50. m/0.25 mm/0.5 μm, He, 35. C @ 10. min, 3. K/min, 200. C @ 10. min |
Capillary | OV-101 | 802.2 | Yin, Liu, et al., 2001 | N2, 1. K/min; Column length: 80. m; Column diameter: 0.22 mm; Tstart: 30. C; Tend: 130. C |
Capillary | Petrocol DH | 798. | White, Hackett, et al., 1992 | 100. m/0.25 mm/0.5 μm, He, 1. K/min; Tstart: 30. C; Tend: 220. C |

Normal alkane RI, non-polar column, custom temperature program

Column type | Active phase | I | Reference | Comment |
---|---|---|---|---|
Capillary | Methyl Silicone | 797. | Spieksma, 1999 | Program: not specified |

References

Streiff, Zimmerman, et al., 1948
Streiff, A.J.; Zimmerman, J.C.; Soule, L.F.; Butt, M.T.; Sedlak, V.A.; Willingham, C.B.; Rossini, F.D.,
, Am. Pet. Inst. Res. Proj. 6 unpublished, 1948. [all data]
Streiff, Murphy, et al., 1946
Streiff, A.J.; Murphy, E.T.; Cahill, J.C.; Soule, L.F.; Sedlak, V.A.; Willingham, C.B.; Rossini, F.D.,
, Am. Pet. Inst. Res. Proj. 6, unpublished, Natl. Bur. Stand., 1946. [all data]