Thioxanthene
- Formula: C13H10S
- Molecular weight: 198.283
- IUPAC Standard InChIKey: PQJUJGAVDBINPI-UHFFFAOYSA-N
- CAS Registry Number: 261-31-4
- Chemical structure:
View 3d structure (requires JavaScript / HTML 5) - Other names: 9H-Thioxanthene; Dibenzothiapyran; Thiaxanthen; Thiaxanthene; Thioxanthen; 10H-dibenzo[b,e]thiin

Phase change data

Data compiled as indicated in comments:
TRC - Thermodynamics Research Center, NIST Boulder Laboratories, Chris Muzny director
AC - William E. Acree, Jr., James S. Chickos
Quantity | Value | Units | Method | Reference | Comment |
---|---|---|---|---|---|
Tfus | 401.7 | K | N/A | Coon, Sediawan, et al., 1988 | Uncertainty assigned by TRC = 0.1 K; TRC |
Quantity | Value | Units | Method | Reference | Comment |
ΔvapH° | 18.6 ± 0.62 | kcal/mol | ME | Freitas, Monte, et al., 2009 | Based on data from 383. to 447. K.; AC |
Quantity | Value | Units | Method | Reference | Comment |
ΔsubH° | 24.31 ± 0.38 | kcal/mol | C | Freitas, Monte, et al., 2009 | AC |
ΔsubH° | 24.12 ± 0.05 | kcal/mol | ME | Freitas, Monte, et al., 2009 | Based on data from 339. to 402. K.; AC |
Enthalpy of vaporization
ΔvapH (kcal/mol) | Temperature (K) | Method | Reference | Comment |
---|---|---|---|---|
16.6 ± 0.05 | 415. | ME | Freitas, Monte, et al., 2009 | Based on data from 383. to 447. K.; AC |
Enthalpy of sublimation
ΔsubH (kcal/mol) | Temperature (K) | Method | Reference | Comment |
---|---|---|---|---|
23.5 ± 0.05 | 370. | ME | Freitas, Monte, et al., 2009 | Based on data from 339. to 402. K.; AC |
Enthalpy of fusion
ΔfusH (kcal/mol) | Temperature (K) | Reference | Comment |
---|---|---|---|
6.24 | 401.8 | Acree, 1991 | AC |

References

Coon, Sediawan, et al., 1988
Coon, J.E.; Sediawan, W.B.; Auwaerter, J.E.; McLaughlin, E.,
Solubilities of families of heterocyclic polynuclear aromatics in organic solvents and their mixtures,
J. Solution Chem., 1988, 17, 519. [all data]
Freitas, Monte, et al., 2009
Freitas, Vera L.S.; Monte, Manuel J.S.; Santos, Luis M.N.B.F.; Gomes, Jose R.B.; Ribeiro da Silva, Maria D.M.C.,
Energetic Studies and Phase Diagram of Thioxanthene,
J. Phys. Chem. A, 2009, 113, 46, 12988-12994, https://doi.org/10.1021/jp906413y
. [all data]
Acree, 1991
Acree, William E.,
Thermodynamic properties of organic compounds: enthalpy of fusion and melting point temperature compilation,
Thermochimica Acta, 1991, 189, 1, 37-56, https://doi.org/10.1016/0040-6031(91)87098-H
. [all data]