3,6-Heptadien-2-ol, 2,5,5-trimethyl-, (E)-
- Formula: C10H18O
- Molecular weight: 154.2493
- IUPAC Standard InChIKey: CSMMFGCGBLZIJE-BQYQJAHWSA-N
- CAS Registry Number: 26127-98-0
- Chemical structure:
View 3d structure (requires JavaScript / HTML 5) - Species with the same structure:
- Other names: (E)-2,5,5-Trimethylhepta-3,6-dien-2-ol; Yamogi alcohol; Yomogi alchool

Kovats' RI, non-polar column, temperature ramp

Column type | Active phase | I | Reference | Comment |
---|---|---|---|---|
Capillary | DB-5 | 1000. | Avato, Raffo, et al., 2004 | 30. m/0.25 mm/0.25 μm, H2, 4. K/min, 280. C @ 30. min; Tstart: 40. C |

Van Den Dool and Kratz RI, non-polar column, temperature ramp

Column type | Active phase | I | Reference | Comment |
---|---|---|---|---|
Capillary | HP-5MS | 999. | Saroglou, Dorizas, et al., 2006 | 30. m/0.25 mm/0.25 μm, He, 60. C @ 5. min, 4. K/min; Tend: 280. C |

Van Den Dool and Kratz RI, non-polar column, custom temperature program

Column type | Active phase | I | Reference | Comment |
---|---|---|---|---|
Capillary | HP-5MS | 1000.3 | Andriamaharavo, 2014 | 30. m/0.25 mm/0.25 μm, He; Program: 60C (1 min) => 5 C/min => 210C => 10 C/min => 280C (15 min) |

References

Avato, Raffo, et al., 2004
Avato, P.; Raffo, F.; Aldouri, N.A.; Vartanian, S.T.,
Essential oils of varthemia iphionoides from Jordan,
Flavour Fragr. J., 2004, 19, 6, 559-561, https://doi.org/10.1002/ffj.1351
. [all data]
Saroglou, Dorizas, et al., 2006
Saroglou, V.; Dorizas, N.; Kypriotakis, Z.; Skaltsa, H.D.,
Analysis of the essential oil composition of eight Anthemis species from Greece,
J. Chromatogr. A, 2006, 1104, 1-2, 313-322, https://doi.org/10.1016/j.chroma.2005.11.087
. [all data]
Andriamaharavo, 2014
Andriamaharavo, N.R.,
Retention Data. NIST Mass Spectrometry Data Center., NIST Mass Spectrometry Data Center, 2014. [all data]