Cyanomethylene
- Formula: C2HN
- Molecular weight: 39.0360
- IUPAC Standard InChIKey: SZICEGNEOSKVLO-UHFFFAOYSA-N
- CAS Registry Number: 2612-62-6
- Chemical structure:
View 3d structure (requires JavaScript / HTML 5) - Other names: HCCN radical

Reaction thermochemistry data

Data compiled by: John E. Bartmess
Individual Reactions
(CAS Reg. No. 74595-99-6 • 4294967295) +
= CAS Reg. No. 74595-99-6
By formula: (CAS Reg. No. 74595-99-6 • 4294967295C2HN) + C2HN = CAS Reg. No. 74595-99-6
Quantity | Value | Units | Method | Reference | Comment |
---|---|---|---|---|---|
ΔrH° | 183. ± 28. | kJ/mol | N/A | Poutsma, Upshaw, et al., 2002 | gas phase |
ΔrH° | 183. ± 10. | kJ/mol | CIDT | Poutsma, Upshaw, et al., 2002 | gas phase |

Gas phase ion energetics data

Data compiled by: John E. Bartmess
Electron affinity determinations
EA (eV) | Method | Reference | Comment |
---|---|---|---|
2.003 ± 0.014 | LPES | Nimlos, Davico, et al., 2002 | |
1.883 ± 0.013 | LPES | Nimlos, Davico, et al., 2002 | |
2.01 ± 0.34 | D-EA | Matimba, Crabbendam, et al., 1992 | |
1.93 ± 0.34 | D-EA | Grabowski and Melly, 1987 | Between H2O2 and mCl-toluene |
0.80 ± 0.40 | EIAE | Heni and Illenberger, 1986 | From MeCN |
>1.09997 | EIAE | Tsuda, Yokohata, et al., 1971 | From MeCN. G3MP2B3 calculations indicate an EA of ca. 2.0 eV. |

Vibrational and/or electronic energy levels

Data compiled by: Marilyn E. Jacox
State: ?
Energy (cm-1) |
Med. | Transition | λmin (nm) |
λmax (nm) |
References | ||
---|---|---|---|---|---|---|---|
Ar | 240 | 340 | Dendramis and Leroi, 1977 | ||||
State: a
Energy (cm-1) |
Med. | Transition | λmin (nm) |
λmax (nm) |
References | ||
---|---|---|---|---|---|---|---|
To = 4115 ± 120 | gas | Nimlos, Davico, et al., 2002 | |||||
Vogelhuber, Wren, et al., 2011 | |||||||
Vib. sym. |
No. | Approximate type of mode |
cm-1 | Med. | Method | References | |
---|---|---|---|---|---|---|---|
2 | CN stretch | 1936 ± 40 | gas | PE | Vogelhuber, Wren, et al., 2011 | ||
State: X
Vib. sym. |
No. | Approximate type of mode |
cm-1 | Med. | Method | References | |
---|---|---|---|---|---|---|---|
Σ+ | 1 | CH stretch | 3246.66 | gas | CC | Morter, Farhat, et al., 1993 | |
1 | CH stretch | 3229.4 | s | Ar | IR | Dendramis and Leroi, 1977 Maier, Reisenauer, et al., 1998 | |
1 | CH stretch | 3213.3 | N2 | IR | Maier, Reisenauer, et al., 1998 | ||
2 | CCN a-stretch | 1734.9 | s | Ar | IR | Dendramis and Leroi, 1977 Maier, Reisenauer, et al., 1998 | |
2 | CCN a-stretch | 1750.3 | N2 | IR | Maier, Reisenauer, et al., 1998 | ||
3 | CCN s-stretch | 1178.6 | w m | Ar | IR | Dendramis and Leroi, 1977 Maier, Reisenauer, et al., 1998 | |
Π | 4 | H deform. | 383 ± 20 | gas | CC MW | Morter, Farhat, et al., 1993 McCarthy, Gottlieb, et al., 1995 | |
5 | Skel. deform. | 128.91 | gas | MW CC | McCarthy, Gottlieb, et al., 1995 Han, Hung, et al., 1999 Allen, Evenson, et al., 2001 Nimlos, Davico, et al., 2002 | ||
Additional references: Jacox, 1994, page 156; Jacox, 1998, page 234; Jacox, 2003, page 185; Bernheim, Kempf, et al., 1965; Merer and Travis, 1965; Merer and Travis, 1966; Saito, Endo, et al., 1984; Brown, Saito, et al., 1990; Endo and Ohshima, 1993; Sun, Kosterev, et al., 1998; Jones, Sun, et al., 2001; Hung, Sun, et al., 2001

References

Poutsma, Upshaw, et al., 2002
Poutsma, J.C.; Upshaw, S.D.; Squires, R.R.; Wenthold, P.G.,
Absolute heat of formation and singlet-triplet splitting for HCCN,
J. Phys. Chem. A, 2002, 106, 6, 1067-1073, https://doi.org/10.1021/jp013653q
. [all data]
Nimlos, Davico, et al., 2002
Nimlos, M.R.; Davico, G.; Geise, C.M.; Wenthold, P.G.; Lineberger, W.C.; Blanksby, S.J.; Hadad, C.M.; Petersso,
Photoelectron spectroscopy of HCCN- and HCNC- reveals the quasilinear triplet carbenes, HCCN and HCNC,
J. Chem. Phys., 2002, 117, 9, 4323-4339, https://doi.org/10.1063/1.1496473
. [all data]
Matimba, Crabbendam, et al., 1992
Matimba, H.E.K.; Crabbendam, A.M.; Ingemann, S.; Nibbering, N.M.M.,
Gas-phase Bimolecular Chemistry of the .-CHNC and .-CHCN Radical Anions,
Int. J. Mass Spectrom. Ion Proc., 1992, 114, 1-2, 85, https://doi.org/10.1016/0168-1176(92)85024-T
. [all data]
Grabowski and Melly, 1987
Grabowski, J.J.; Melly, S.J.,
Formation of carbene radical anions: Gas phase reaction of the atomic oxygen anion with organic neutrals,
Int. J. Mass Spectrom. Ion Processes, 1987, 81, 147. [all data]
Heni and Illenberger, 1986
Heni, M.; Illenberger, E.,
Electron attachment by saturated nitriles. Acrylonitrile (CH2H3CN), and benzonitrile (C6H5CN),
Int. J. Mass Spectrom. Ion Phys., 1986, 73, 127. [all data]
Tsuda, Yokohata, et al., 1971
Tsuda, S.; Yokohata, A.; Umaba, T.,
Measurement of negative ions formed by electron impact. VIII. Ionization efficiency curves of negative ions from methyl and ethyl cyanides,
Bull. Chem. Soc. Jpn., 1971, 44, 1486. [all data]