Iprobenfos
- Formula: C13H21O3PS
- Molecular weight: 288.343
- IUPAC Standard InChIKey: FCOAHACKGGIURQ-UHFFFAOYSA-N
- CAS Registry Number: 26087-47-8
- Chemical structure:
View 3d structure (requires JavaScript / HTML 5) - Other names: Kitazin P; Phosphorothioic acid, O,O-bis(1-methylethyl) S-(phenylmethyl) ester; Phosphorothioic acid, S-benzyl O,O-diisopropyl ester; IBP; Kitazin L; O,O-Diisopropyl S-Benzyl phosphorothioate; O,O-Diisopropyl S-benzyl thiophosphate; S-Benzyl O,O-diisopropyl phosphorothioate; S-Benzyl O,O-diisopropyl thiophosphate; Iprofenfos; O,O-Diisopropyl S-benzyl phosphorothiolate; Ricid II; Ricid P; S-benzyl diisopropyl phosphorothioate

Kovats' RI, non-polar column, custom temperature program

Column type | Active phase | I | Reference | Comment |
---|---|---|---|---|
Capillary | HP-5 | 1838. | Tanabe, Mitobe, et al., 2000 | 30. m/0.32 mm/0.25 μm; Program: 50C(1min) => 20C/min => 150C => 10C/min => 280C(4min) |

Normal alkane RI, non-polar column, isothermal

Column type | Active phase | Temperature (C) | I | Reference | Comment |
---|---|---|---|---|---|
Packed | OV-1 | 190. | 1820. | TSunoda, 1986 | Helium, Chromosorb W AW DMCS; Column length: 1. m |

Normal alkane RI, non-polar column, temperature ramp

Column type | Active phase | I | Reference | Comment |
---|---|---|---|---|
Capillary | HP-5 | 1859. | Murayama, Mukai, et al., 2000 | 30. m/0.32 mm/0.25 μm, 50. C @ 1. min, 10. K/min, 300. C @ 4. min |
Packed | OV-1 | 1805. | TSunoda, 1986 | Helium, Chromosorb W AW DMCS, 4. K/min, 210. C @ 20. min; Column length: 1. m; Tstart: 140. C |

Normal alkane RI, non-polar column, custom temperature program

Column type | Active phase | I | Reference | Comment |
---|---|---|---|---|
Capillary | 5 % Phenyl methyl siloxane | 1845. | Department of Food Safety and Welfare, 2006 | 30. m/0.25 mm/0.25 μm, Helium; Program: 50 0C(1 min) 25 0C/min -> 125 0C 10 0C/min -> 300 0C (10 min) |
Capillary | HP-5 | 1838. | Kawara, Asada, et al., 2005 | 30. m/0.25 mm/0.25 μm; Program: 50 0C (1 min) 20 0C/min -> 150 0C 10 0C/min -> 280 0C |
Capillary | Ultra-1 | 1783. | Tameo and Kiyos, 1991 | Program: not specified |

Normal alkane RI, polar column, custom temperature program

Column type | Active phase | I | Reference | Comment |
---|---|---|---|---|
Capillary | Carbowax 20M | 2534. | Tameo and Kiyos, 1991 | Program: not specified |

Phase change data

Data compiled by: Robert L. Brown and Stephen E. Stein

Reduced pressure boiling point

Tboil (K) Pressure (bar) Reference
399.0.00005Buckingham and Donaghy, 1982

References

Tanabe, Mitobe, et al., 2000
Tanabe, A.; Mitobe, H.; Kawata, K.; Sakai, M.; Yasuhara, A.,
New monitoring system for ninety pesticides and related compounds in river water by solid-phase extraction with determination by gas chromatography/mass spectrometry,
J. AOAC Int., 2000, 83, 1, 61-77. [all data]
TSunoda, 1986
TSunoda, N.,
Simultaneous determination of organophosphorous pesticides in forencis chemistry by gas-liquid chromatography with hydrogen flame ionization detector,
Eisei Kagaku, 1986, 32, 2, 91-100, https://doi.org/10.1248/jhs1956.32.91
. [all data]
Murayama, Mukai, et al., 2000
Murayama, H.; Mukai, H.; Mitobe, H.; Moriyama, N.,
Simple method for determining trace pesticides in air using extraction disks,
Anal. Sci., 2000, 16, 3, 257-263, retrieved from http://wwwsoc.nii.ac.;p/jsac/analsci/pdfs/a160257.pdf, https://doi.org/10.2116/analsci.16.257
. [all data]
Department of Food Safety and Welfare, 2006
Department of Food Safety, Ministry of Health; Welfare,
Analytical methods for residual compositional substances of agricultural chemicals, feed aadditives, and veterinary drugs in foods, 2006, retrieved from http://www.mhlw.go.jp/english/topics/foodsafety/positivelist060228/de/060526-1a.pdf. [all data]
Kawara, Asada, et al., 2005
Kawara, K.; Asada, T.; Oikawa, K.; Tanabe, A.,
Multiresidue determination of pesticides in sediments by ultrasonically assisted extraction and gas chromatography/mass spectrometry,
J. AOAC International, 2005, 88, 5, 1440-1451. [all data]
Tameo and Kiyos, 1991
Tameo, O.; Kiyos, I.,
Simultaneous determination of pesticides by capillary gas chromatography,
Cannot be traslated (in Japan), 1991, 14, 2, 109-122. [all data]