Diazene, dicyclohexyl-, 1,2-dioxide, (E)-
- Formula: C12H22N2O2
- Molecular weight: 226.3153
- IUPAC Standard InChIKey: IQCWPIHWVLBCTQ-BUHFOSPRSA-N
- CAS Registry Number: 26049-06-9
- Chemical structure:
View 3d structure (requires JavaScript / HTML 5) - Stereoisomers:

Reaction thermochemistry data

Data compiled by: Hussein Y. Afeefy, Joel F. Liebman, and Stephen E. Stein
Individual Reactions
By formula: C12H22N2O2 = 2C12H22N2O2
Quantity | Value | Units | Method | Reference | Comment |
---|---|---|---|---|---|
ΔrH° | 86. ± 2. | kJ/mol | Cm | Keussler and Luttke, 1959 | liquid phase; solvent: Benzene |

References

Keussler and Luttke, 1959
Keussler, V.v.; Luttke, W.,
Spektroskopische Untersuchungen an Nitrosoverbindungen. 3. Mitteilung: Die Dissoziationsenergie der Nitrosodimeren,
Z. Elektrochem., 1959, 63, 614-623. [all data]