2,3,5,6-Tetramethylbenzoic acid

Gas phase thermochemistry data

Data compiled as indicated in comments:
ALS - Hussein Y. Afeefy, Joel F. Liebman, and Stephen E. Stein
DRB - Donald R. Burgess, Jr.

Quantity Value Units Method Reference Comment
Δfgas-400.1 ± 2.2kJ/molCmColomina, Jimenez, et al., 1988see Colomina, Perez-Ossorio, et al., 1964; see 60COL/PER; ALS
Δfgas-400.0kJ/molN/AColomina, Perez-Ossorio, et al., 1960Value computed using ΔfHsolid° value of -506.1±1.0 kj/mol from Colomina, Perez-Ossorio, et al., 1960 and ΔsubH° value of 106.1 kj/mol from Colomina, Jimenez, et al., 1988.; DRB

Phase change data

Data compiled as indicated in comments:
ALS - Hussein Y. Afeefy, Joel F. Liebman, and Stephen E. Stein
DRB - Donald R. Burgess, Jr.
AC - William E. Acree, Jr., James S. Chickos

Quantity Value Units Method Reference Comment
Δsub106.1 ± 0.8kJ/molVColomina, Jimenez, et al., 1988see Colomina, Perez-Ossorio, et al., 1964; see 60COL/PER; ALS
Δsub106.1kJ/molN/AColomina, Jimenez, et al., 1988DRB
Δsub106.1 ± 0.8kJ/molMEColomina, Jimenez, et al., 1988Based on data from 330. - 351. K.; AC

Enthalpy of sublimation

ΔsubH (kJ/mol) Temperature (K) Method Reference Comment
104.6 ± 0.8341.MEColomina, Jimenez, et al., 1988Based on data from 330. - 351. K.; AC

Gas phase ion energetics data

Data compiled by: John E. Bartmess

De-protonation reactions

C11H13O2- + Hydrogen cation = 2,3,5,6-Tetramethylbenzoic acid

By formula: C11H13O2- + H+ = C11H14O2

Quantity Value Units Method Reference Comment
Δr1417. ± 8.8kJ/molG+TSDecouzon, Ertl, et al., 1993gas phase; relative to benzoate at 333.0 kcal/mol
Quantity Value Units Method Reference Comment
Δr1387. ± 8.4kJ/molIMREDecouzon, Ertl, et al., 1993gas phase; relative to benzoate at 333.0 kcal/mol

References

Colomina, Jimenez, et al., 1988
Colomina, M.; Jimenez, P.; Perez-Ossorio, R.; Roux, M.V.; Turrion, C., Thermochemical properties of benzoic acid derivatives. XVI. Vapour pressures and enthalpies of sublimation and formation of the three tetramethylbenzoic acids and of pentamenthylbenzoic acid, J. Chem. Thermodyn., 1988, 20, 575-580. [all data]

Colomina, Perez-Ossorio, et al., 1964
Colomina, M.; Perez-Ossorio, R.; Turrion, C.; Boned, M.L.; Pedraja, B., Investigaciones termoquimicas sobre los acidos alquilbenzoicos, Anal. Fisc. Quim. B, 1964, 60, 627-638. [all data]

Colomina, Perez-Ossorio, et al., 1960
Colomina, M.; Perez-Ossorio, R.; Boned, M.L.; Panea, M.; Turrion, C., Thermochemical investigations on methylsubstituted benzoic acid, Rpt. for the US. Dept. of the Army, European Research Office contract no. DA-91-591-EUC-1364-OI-4291-60 by Instituto de Quimica Fisica Madrid, Spain, 1960, 1-38. [all data]