Ethylmercurichlorendimide
- Formula: C11H7Cl6HgNO2
- Molecular weight: 598.49
- IUPAC Standard InChIKey: HTCXJNNIWILFQQ-UHFFFAOYSA-M
- CAS Registry Number: 2597-93-5
- Chemical structure:
View 3d structure (requires JavaScript / HTML 5) - Other names: Mercury, ethyl(4,5,6,7,8,8-hexachloro-1,3,3a,4,7,7a-hexahydro-1,3-dioxo-4,7-methano-2H-isoindol-2-yl)-; Mercury, ethyl(1,4,5,6,7,7-hexachloro-5-norbornene-2,3-dicarboximidato)-; EMMI; 4,7-Methano-1H-Isoindole-1,3(2H)-dione, 4,5,6,7,8,8-hexachloro-2-(ethylmercurio)-3a,4,7,7a-tetrahydro-; 50-CS-46; N-(Ethylmercuri)-1,4,6,6,7,7-hexa-cl-bicyclo(2.2.1)hept-5-ene-2,3-dicarboximide; N-(Ethylmercuri)-1,2,3,6-tetrahydro-3,6-endomethano-3,4,5,6,7,7-hexachlorophthalimide; N-(Ethylmercuri)-1,4,5,6,7,7-hexachlorobicyclo(2.2.1)hept-5-ene-2,3-dicarboximide; N-(Ethylmercuri)-3,4,5,6,7,7-hexachloro-3,6-endomethylene-1,2,3,6-tetrahydrophthalimide; 3,4,5,6,7,7-Hexachloro-N-(ethylmercuri)-1,2,3,6-tetrahydro-3,6-endomethanophthalimide; 5-Norbornene-2,3-dicarboximide, 1,4,5,6,7,7-hexachloro-N-(ethylmercuri)-; Mercury, ethyl(1,4,5,6,7,7-hexachloro-5-norbornene-2,3,-dicarboximido); Mercury, ethyl(4,5,6,7,8,8-hexachloro-3a,4,7,7a-tetrahydro-4,7-methano-1H-isoindole-1,3(2H)-dionato-κN2)-; NSC 22200

Phase change data

Data compiled by: Thermodynamics Research Center, NIST Boulder Laboratories, Chris Muzny director
Quantity | Value | Units | Method | Reference | Comment |
---|---|---|---|---|---|
Tfus | 465.69 | K | N/A | Donnelly, Drewes, et al., 1990 | Uncertainty assigned by TRC = 0.2 K |

References

Donnelly, Drewes, et al., 1990
Donnelly, J.R.; Drewes, L.A.; Johnson, R.L.; Munslow, W.D.; Knapp, K.K.; Sovocool, G.W.,
Purity and heat of fusion data for environmental standards as determined by differential scanning calorimetry,
Thermochim. Acta, 1990, 167, 2, 155, https://doi.org/10.1016/0040-6031(90)80476-F
. [all data]