Formyl radical
- Formula: CHO
- Molecular weight: 29.0180
- IUPAC Standard InChIKey: CFHIDWOYWUOIHU-UHFFFAOYSA-N
- CAS Registry Number: 2597-44-6
- Chemical structure:
View 3d structure (requires JavaScript / HTML 5) - Isotopologues:

Gas phase thermochemistry data

Quantity | Value | Units | Method | Reference | Comment |
---|---|---|---|---|---|
ΔfH°gas | 43.51 | kJ/mol | Review | Chase, 1998 | Data last reviewed in December, 1970 |
ΔfH°gas | 42. ± 4. | kJ/mol | N/A | Tsang, 1996 | |
Quantity | Value | Units | Method | Reference | Comment |
S°gas,1 bar | 224.65 | J/mol*K | Review | Chase, 1998 | Data last reviewed in December, 1970 |
Gas Phase Heat Capacity (Shomate Equation)
Cp° = A + B*t + C*t2 + D*t3 +
E/t2
H° − H°298.15= A*t + B*t2/2 +
C*t3/3 + D*t4/4 − E/t + F − H
S° = A*ln(t) + B*t + C*t2/2 + D*t3/3 −
E/(2*t2) + G
Cp = heat capacity (J/mol*K)
H° = standard enthalpy (kJ/mol)
S° = standard entropy (J/mol*K)
t = temperature (K) / 1000.
View plot Requires a JavaScript / HTML 5 canvas capable browser.
Temperature (K) | 298. to 1200. | 1200. to 6000. |
---|---|---|
A | 21.13803 | 52.79371 |
B | 40.43610 | 2.666155 |
C | -14.71337 | -0.392339 |
D | 0.969010 | 0.023808 |
E | 0.239639 | -7.457018 |
F | 36.34712 | 11.37797 |
G | 240.1695 | 267.2798 |
H | 43.51402 | 43.51402 |
Reference | Chase, 1998 | Chase, 1998 |
Comment | Data last reviewed in December, 1970 | Data last reviewed in December, 1970 |

References

Chase, 1998
Chase, M.W., Jr.,
NIST-JANAF Themochemical Tables, Fourth Edition,
J. Phys. Chem. Ref. Data, Monograph 9, 1998, 1-1951. [all data]
Tsang, 1996
Tsang, W.,
Heats of Formation of Organic Free Radicals by Kinetic Methods
in Energetics of Organic Free Radicals, Martinho Simoes, J.A.; Greenberg, A.; Liebman, J.F., eds., Blackie Academic and Professional, London, 1996, 22-58. [all data]