Mecarbam
- Formula: C10H20NO5PS2
- Molecular weight: 329.373
- IUPAC Standard InChIKey: KLGMSAOQDHLCOS-UHFFFAOYSA-N
- CAS Registry Number: 2595-54-2
- Chemical structure:
View 3d structure (requires JavaScript / HTML 5) - Other names: 7-Oxa-5-thia-2-aza-6-phosphanonanoic acid, 6-ethoxy-2-methyl-3-oxo-, ethyl ester, 6-sulfide; Carbamic acid, (mercaptoacetyl)methyl-, ethyl ester, S-ester with O,O-diethyl phosphorodithioic acid; Marfotoks; Mercarbam; Murfotox; Murphotox; MS 1053; MS 1143; Pennsalt TD 72; Pestan; Phosphorodithioic acid, O,O-diethyl ester, S-ester with ethyl (mercaptoacetyl)methylcarbamate; TD 72; S-(N-Ethoxycarbonyl-N-methylcarbamoylmethyl) O,O-diethyl phosphorodithioate; Afos; O,O-Diaethyl-S-(3-methyl-2,4-dioxo-5-oxa-3-aza-heptyl)-dithiophosphat; O,O-Diethyl S-(N-ethoxycarbonyl-N-methylcarbamoylmethyl) phosphorodithioate; O,O-Diethyl S-(N-ethoxycarbonyl-N-methylcarbamoylmethyl) phosphorothiolothionate; O,O-Diethyl S-(N-methyl-N-carboethoxycarbamoylmethyl) dithiophosphate; O,O-Diethyl-S-(3-methyl-2,4-dioxo-5-oxa-3-aza-heptyl)-dithiofosfaat; O,O-Dietil-S-(N-etossi-carbonil-N-metil-carbamoil-metil)-ditiofosfato; Dithiophosphate de O,O-diethyle et de S-N-methyl N-carboethoxy carbamoylmethyle; N-Ethoxycarbonyl-N-methylcarbamoylmethyl O,O-diethyl phosphorodithioate; S-((Ethoxycarbonyl)methylcarbamoyl)methyl O,O-diethyl phosphorodithioate; S-(N-Ethoxycarbonyl-N-methylcarbamoylmethyl)-diethyl phosphorodithioate; MC 474; Mecarbame; Muratox; Murutox; P 474; Carbamic acid, (mercaptoacetyl)methyl-, ethyl ester, O,O-diethyl phosphorodithioate; Carbamic acid, (mercaptoacetyl)methyl-, ethyl ester, S-ester with O,O-diethyl phosphorodithioate; Criotox

Kovats' RI, non-polar column, isothermal

Column type | Active phase | Temperature (C) | I | Reference | Comment |
---|---|---|---|---|---|
Packed | SE-30 | 210. | 2052. | Oyama, Sano, et al., 1987 | N2, AW-DMCS; Column diameter: 0.53 mm |

Van Den Dool and Kratz RI, non-polar column, temperature ramp

Column type | Active phase | I | Reference | Comment |
---|---|---|---|---|
Packed | OV-1 | 2044. | Oyama, Sano, et al., 1987 | N2, AW-DMCS, 2. K/min; Column diameter: 0.53 mm; Tstart: 80. C; Tend: 220. C |
Capillary | CBP-1 | 2010. | Oyama, Sano, et al., 1987 | N2, 6. K/min; Column length: 12. m; Column diameter: 0.53 mm; Tstart: 120. C; Tend: 250. C |

Normal alkane RI, non-polar column, isothermal

Column type | Active phase | Temperature (C) | I | Reference | Comment |
---|---|---|---|---|---|
Packed | OV-1 | 190. | 2030. | TSunoda, 1986 | Helium, Chromosorb W AW DMCS; Column length: 1. m |

Normal alkane RI, non-polar column, temperature ramp

Column type | Active phase | I | Reference | Comment |
---|---|---|---|---|
Packed | OV-1 | 2020. | TSunoda, 1986 | Helium, Chromosorb W AW DMCS, 4. K/min, 210. C @ 20. min; Column length: 1. m; Tstart: 140. C |

References

Oyama, Sano, et al., 1987
Oyama, N.; Sano, T.; Syoyama, M.; Maeda, K.,
Studies on systematic analysis of poisonous compounds in forensic chemistry. II. Application of capillary column gas chromatography to substance identification by means of retention indices,
Eisei Kagaku, 1987, 33, 5, 342-348, https://doi.org/10.1248/jhs1956.33.342
. [all data]
TSunoda, 1986
TSunoda, N.,
Simultaneous determination of organophosphorous pesticides in forencis chemistry by gas-liquid chromatography with hydrogen flame ionization detector,
Eisei Kagaku, 1986, 32, 2, 91-100, https://doi.org/10.1248/jhs1956.32.91
. [all data]