1H-Cyclopent[b]anthracene
- Formula: C17H12
- Molecular weight: 216.2772
- IUPAC Standard InChIKey: JTPMJORHSIMNNC-UHFFFAOYSA-N
- CAS Registry Number: 259-06-3
- Chemical structure:
View 3d structure (requires JavaScript / HTML 5) - Permanent link for this species. Use this link for bookmarking this species for future reference.

Gas phase thermochemistry data

Data compiled by: Glushko Thermocenter, Russian Academy of Sciences, Moscow
Constant pressure heat capacity of gas
Cp,gas (J/mol*K) | Temperature (K) | Reference | Comment |
---|---|---|---|
46.18 | 50. | Dorofeeva O.V., 1989 | These statistically calculated values were obtained using force field approximation for polycyclic aromatic hydrocarbons to estimate the needed vibrational frequencies (see also [ Dorofeeva O.V., 1986, Moiseeva N.F., 1990]). These functions are reproduced in the reference book [ Frenkel M., 1994]. |
72.29 | 100. | ||
103.87 | 150. | ||
140.65 | 200. | ||
200.19 | 273.15 | ||
220.9 ± 1.5 | 298.15 | ||
222.39 | 300. | ||
300.19 | 400. | ||
365.30 | 500. | ||
417.48 | 600. | ||
459.24 | 700. | ||
493.11 | 800. | ||
520.95 | 900. | ||
544.10 | 1000. | ||
563.54 | 1100. | ||
579.96 | 1200. | ||
593.93 | 1300. | ||
605.88 | 1400. | ||
616.15 | 1500. |

References

Dorofeeva O.V., 1989
Dorofeeva O.V.,
Thermodynamic Properties of Gaseous Polycyclic Aromatic Hydrocarbons Containing Five-Membered Rings. Institute for High Temperatures, USSR Academy of Sciences, Preprint No.1-263 (in Russian), Moscow, 1989. [all data]
Dorofeeva O.V., 1986
Dorofeeva O.V.,
On calculation of thermodynamic properties of polycyclic aromatic hydrocarbons,
Thermochim. Acta, 1986, 102, 59-66. [all data]
Moiseeva N.F., 1990
Moiseeva N.F.,
Group additivity scheme for calculating the chemical thermodynamic properties of gaseous polycyclic aromatic hydrocarbons containing five-membered rings,
Thermochim. Acta, 1990, 168, 179-186. [all data]
Frenkel M., 1994
Frenkel M.,
Thermodynamics of Organic Compounds in the Gas State, Vol. I, II, Thermodynamics Research Center, College Station, Texas, 1994, 1994. [all data]