Urea, N,N-dibutyl-N'-phenyl-
- Formula: C15H24N2O
- Molecular weight: 248.3639
- IUPAC Standard InChIKey: VLAGNIMOLLTGGE-UHFFFAOYSA-N
- CAS Registry Number: 2589-21-1
- Chemical structure:
View 3d structure (requires JavaScript / HTML 5) - Other names: Urea, 1,1-dibutyl-3-phenyl-; 1,1-Dibutyl-3-phenylurea

Reaction thermochemistry data

Data compiled by: Hussein Y. Afeefy, Joel F. Liebman, and Stephen E. Stein
Individual Reactions
By formula: C7H5NO + C8H19N = C15H24N2O
Quantity | Value | Units | Method | Reference | Comment |
---|---|---|---|---|---|
ΔrH° | -1088.8 ± 1.7 | kJ/mol | Cm | Kiselev, Malkov, et al., 1989 | liquid phase; solvent: Dioxane |

References

Kiselev, Malkov, et al., 1989
Kiselev, V.D.; Malkov, V.B.; Murzin, D.G.; Shakirov, I.M.; Konovalov, A.I.,
Thermochemical study of the reaction of isocyanate with amines,
Dokl. Phys. Chem. (Engl. Transl.), 1989, 308, 711-713, In original 111. [all data]