Diazene, dimethyl-, 1-oxide
- Formula: C2H6N2O
- Molecular weight: 74.0818
- IUPAC Standard InChIKey: DGAKHGXRMXWHBX-UHFFFAOYSA-N
- CAS Registry Number: 25843-45-2
- Chemical structure:
View 3d structure (requires JavaScript / HTML 5) - Stereoisomers:
- Other names: Azoxymethane; Methane, azoxy-; AOM

Phase change data

Data compiled by: Robert L. Brown and Stephen E. Stein
Quantity | Value | Units | Method | Reference | Comment |
---|---|---|---|---|---|
Tboil | 371. | K | N/A | Buckingham and Donaghy, 1982 |

References

Buckingham and Donaghy, 1982
Buckingham, J.; Donaghy, S.M.,
Dictionary of Organic Compounds: Fifth Edition, Chapman and Hall, New York, 1982, 1. [all data]