Phenol, 3-methyl-4-nitro-
- Formula: C7H7NO3
- Molecular weight: 153.1354
- IUPAC Standard InChIKey: PIIZYNQECPTVEO-UHFFFAOYSA-N
- CAS Registry Number: 2581-34-2
- Chemical structure:
View 3d structure (requires JavaScript / HTML 5) - Other names: m-Cresol, 4-nitro-; 4-Nitro-3-cresol; p-Nitro-m-cresol; 2-Nitro-5-hydroxytoluene; 3-Methyl-4-nitrophenol; 4-Nitro-m-cresol; 4-Nitro-3-methylphenol; 5-Hydroxy-2-nitrotoluene; 4-Nitro-5-methylphenol; 4-Nitro-1-hydroxy-3-methylbenzene; 5-Methyl-4-nitrophenol; NSC 69190; p-Nitro-m-methylphenol

Phase change data

Data compiled as indicated in comments:
TRC - Thermodynamics Research Center, NIST Boulder Laboratories, Chris Muzny director
AC - William E. Acree, Jr., James S. Chickos
Quantity | Value | Units | Method | Reference | Comment |
---|---|---|---|---|---|
Tfus | 401.0 | K | N/A | Buchowski, Jodzewicz, et al., 1975 | Uncertainty assigned by TRC = 0.1 K; TRC |
Quantity | Value | Units | Method | Reference | Comment |
ΔvapH° | 20.5 | kcal/mol | B | Heintz, Kapteina, et al., 2007 | AC |
Enthalpy of fusion
ΔfusH (kcal/mol) | Temperature (K) | Reference | Comment |
---|---|---|---|
6.55 | 401. | Acree, 1991 | AC |

Reaction thermochemistry data

Data compiled by: John E. Bartmess
Individual Reactions
C7H6NO3- + =
By formula: C7H6NO3- + H+ = C7H7NO3
Quantity | Value | Units | Method | Reference | Comment |
---|---|---|---|---|---|
ΔrH° | 329.9 ± 2.1 | kcal/mol | G+TS | Fujio, McIver, et al., 1981 | gas phase; value altered from reference due to change in acidity scale |
Quantity | Value | Units | Method | Reference | Comment |
ΔrG° | 322.6 ± 2.0 | kcal/mol | IMRE | Fujio, McIver, et al., 1981 | gas phase; value altered from reference due to change in acidity scale |

Gas phase ion energetics data

Data compiled by: John E. Bartmess
De-protonation reactions
C7H6NO3- + =
By formula: C7H6NO3- + H+ = C7H7NO3
Quantity | Value | Units | Method | Reference | Comment |
---|---|---|---|---|---|
ΔrH° | 329.9 ± 2.1 | kcal/mol | G+TS | Fujio, McIver, et al., 1981 | gas phase; value altered from reference due to change in acidity scale |
Quantity | Value | Units | Method | Reference | Comment |
ΔrG° | 322.6 ± 2.0 | kcal/mol | IMRE | Fujio, McIver, et al., 1981 | gas phase; value altered from reference due to change in acidity scale |

Kovats' RI, non-polar column, custom temperature program

Column type | Active phase | I | Reference | Comment |
---|---|---|---|---|
Capillary | HP-5 | 1222.3 | Van Durme, Dewulf, et al., 2007 | Program: not specified |
Capillary | HP-5 | 1225.1 | Van Durme, Dewulf, et al., 2007 | Program: not specified |

References

Buchowski, Jodzewicz, et al., 1975
Buchowski, H.; Jodzewicz, W.; Milek, R.; Ufnalski, W.; Maczynski, A.,
Solubility and Hydrogen Bonding. Part I. Solubility of 4-Nitro-5- Methylphenol in One-Component Solvents,
Rocz. Chem., 1975, 49, 1879-1887. [all data]
Heintz, Kapteina, et al., 2007
Heintz, A.; Kapteina, S.; Verevkin, S.P.,
Pairwise-Substitution Effects and Intramolecular Hydrogen Bonds in Nitrophenols and Methylnitrophenols. Thermochemical Measurements and ab Initio Calculations,
J. Phys. Chem. A, 2007, 111, 28, 6552-6562, https://doi.org/10.1021/jp0730388
. [all data]
Acree, 1991
Acree, William E.,
Thermodynamic properties of organic compounds: enthalpy of fusion and melting point temperature compilation,
Thermochimica Acta, 1991, 189, 1, 37-56, https://doi.org/10.1016/0040-6031(91)87098-H
. [all data]
Fujio, McIver, et al., 1981
Fujio, M.; McIver, R.T., Jr.; Taft, R.W.,
Effects on the acidities of phenols from specific substituent-solvent interactions. Inherent substituent parameters from gas phase acidities,
J. Am. Chem. Soc., 1981, 103, 4017. [all data]
Van Durme, Dewulf, et al., 2007
Van Durme, J.; Dewulf, J.; Sysmans, W.; Leys, C.; Van Langenhove, H.,
Abatement and degradation pathways of toluene in indoor air by positive corona discharge,
Chemosphere, 2007, 68, 10, 1821-1829, https://doi.org/10.1016/j.chemosphere.2007.03.053
. [all data]