4,4'-Bis(octyloxy)azoxybenzene
- Formula: C28H42N2O3
- Molecular weight: 454.6447
- IUPAC Standard InChIKey: LMDKWWQEAJSHLR-UHFFFAOYSA-N
- CAS Registry Number: 25729-12-8
- Chemical structure:

Phase change data

Data compiled by: Thermodynamics Research Center, NIST Boulder Laboratories, Chris Muzny director
Quantity | Value | Units | Method | Reference | Comment |
---|---|---|---|---|---|
Ttriple | 353. | K | N/A | Arnold, 1964 | Smectic liquid crystal phase; Uncertainty assigned by TRC = 0.1 K |
Ttriple | 380.9 | K | N/A | Arnold, 1964 | Smectic liquid crystal phase; Uncertainty assigned by TRC = 0.1 K |
Ttriple | 399.3 | K | N/A | Arnold, 1964 | Smectic liquid crystal phase; Uncertainty assigned by TRC = 0.1 K |

References

Arnold, 1964
Arnold, H.,
Calorimetry of crystalline-liquid materials: II results of the measurements on 12 homologous dialkoxy azeoxy benzenes,
Z. Phys. Chem. (Leipzig), 1964, 226, 146. [all data]