Dibutoxymethane
- Formula: C9H20O2
- Molecular weight: 160.2539
- IUPAC Standard InChIKey: QLCJOAMJPCOIDI-UHFFFAOYSA-N
- CAS Registry Number: 2568-90-3
- Chemical structure:
View 3d structure (requires JavaScript / HTML 5) - Other names: Di-n-butoxymethane; Methane, dibutoxy-; Butane, 1,1'-[methylenebis(oxy)]bis-; Butylal; Dibutyl formal; Formaldehyde dibutyl acetal; Di-n-butyl formal; NSC 241; 1,1'-[methylenebis(oxy)]dibutane

Gas phase thermochemistry data

Data compiled by: Hussein Y. Afeefy, Joel F. Liebman, and Stephen E. Stein
Quantity | Value | Units | Method | Reference | Comment |
---|---|---|---|---|---|
ΔfH°gas | -501. ± 3. | kJ/mol | Ccb | Skuratov, Strepikheev, et al., 1957 | Heat of formation derived by Cox and Pilcher, 1970 |

Condensed phase thermochemistry data

Data compiled by: Hussein Y. Afeefy, Joel F. Liebman, and Stephen E. Stein
Quantity | Value | Units | Method | Reference | Comment |
---|---|---|---|---|---|
ΔfH°liquid | -549. ± 2. | kJ/mol | Ccb | Skuratov, Strepikheev, et al., 1957 | Heat of formation derived by Cox and Pilcher, 1970 |
Quantity | Value | Units | Method | Reference | Comment |
ΔcH°liquid | -5850.5 ± 1.7 | kJ/mol | Ccb | Skuratov, Strepikheev, et al., 1957 | Reanalyzed by Cox and Pilcher, 1970, Original value = -5852.2 kJ/mol; Combustion for liq at 293 K; Corresponding ΔfHºliquid = -549.40 kJ/mol (simple calculation by NIST; no Washburn corrections) |

Phase change data

Data compiled as indicated in comments:
TRC - Thermodynamics Research Center, NIST Boulder Laboratories, Chris Muzny director
AC - William E. Acree, Jr., James S. Chickos
ALS - Hussein Y. Afeefy, Joel F. Liebman, and Stephen E. Stein
DRB - Donald R. Burgess, Jr.
Quantity | Value | Units | Method | Reference | Comment |
---|---|---|---|---|---|
Tboil | 455.0 | K | N/A | Timmermans, 1927 | Uncertainty assigned by TRC = 0.6 K; source of data not clear; TRC |
Tboil | 452.6 | K | N/A | Timmermans, 1922 | Uncertainty assigned by TRC = 0.4 K; TRC |
Quantity | Value | Units | Method | Reference | Comment |
Tfus | 214. | K | N/A | Timmermans, 1927 | Uncertainty assigned by TRC = 0.3 K; TRC |
Tfus | 215.05 | K | N/A | Timmermans, 1922 | Uncertainty assigned by TRC = 0.4 K; TRC |
Quantity | Value | Units | Method | Reference | Comment |
ΔvapH° | 48.1 | kJ/mol | EB | Palczewska-Tulinska and Szafranski, 2000 | Based on data from 363. to 452. K.; AC |
ΔvapH° | 48. ± 3. | kJ/mol | E | Skuratov, Strepikheev, et al., 1957 | Heat of formation derived by Cox and Pilcher, 1970; ALS |
ΔvapH° | 48.0 | kJ/mol | N/A | Skuratov, Strepikheev, et al., 1957 | DRB |
Enthalpy of vaporization
ΔvapH (kJ/mol) | Temperature (K) | Method | Reference | Comment |
---|---|---|---|---|
47.9 | 381. | EB | Palczewska-Tulinska and Szafranski, 2000 | Based on data from 366. to 452. K.; AC |
57.3 | 293. | V | Skuratov, Strepikheev, et al., 1957 | Combustion for liq at 293 K; ALS |

Kovats' RI, non-polar column, isothermal

Column type | Active phase | Temperature (C) | I | Reference | Comment |
---|---|---|---|---|---|
Packed | Apiezon L | 120. | 1020. | Bogoslovsky, Anvaer, et al., 1978 | Celite 545 |
Packed | Apiezon L | 160. | 1036. | Bogoslovsky, Anvaer, et al., 1978 | Celite 545 |

References

Skuratov, Strepikheev, et al., 1957
Skuratov, S.M.; Strepikheev, A.A.; Shtekhter, S.M.; Volokhina, A.V.,
About the enthalpies of polymerization of cyclic formales,
Dokl. Akad. Nauk SSSR, 1957, 117, 263-265. [all data]
Cox and Pilcher, 1970
Cox, J.D.; Pilcher, G.,
Thermochemistry of Organic and Organometallic Compounds, Academic Press, New York, 1970, 1-636. [all data]
Timmermans, 1927
Timmermans, J.,
The Melting Point of Organic Substances,
Bull. Soc. Chim. Belg., 1927, 36, 502. [all data]
Timmermans, 1922
Timmermans, J.,
Investigation of the Freezing Point of Organic Substances VII,
Bull. Soc. Chim. Belg., 1922, 31, 389. [all data]
Palczewska-Tulinska and Szafranski, 2000
Palczewska-Tulinska, Marcela; Szafranski, Andrzej M.,
Selected Physicochemical Properties of Dibutoxymethane,
J. Chem. Eng. Data, 2000, 45, 6, 988-990, https://doi.org/10.1021/je000070l
. [all data]
Bogoslovsky, Anvaer, et al., 1978
Bogoslovsky, Yu.N.; Anvaer, B.I.; Vigdergauz, M.S.,
Chromatographic constants in gas chromatography (in Russian), Standards Publ. House, Moscow, 1978, 192. [all data]