Propane, 2,2'-[methylenebis(oxy)]bis-
- Formula: C7H16O2
- Molecular weight: 132.2007
- IUPAC Standard InChIKey: WDEVXRIFJZNMKM-UHFFFAOYSA-N
- CAS Registry Number: 2568-89-0
- Chemical structure:
View 3d structure (requires JavaScript / HTML 5) - Other names: Methane, diisopropoxy-; Diisopropoxymethane; Diisopropyl formal; Formaldehyde diisopropyl acetal; Isopropylal

Phase change data

Data compiled by: Thermodynamics Research Center, NIST Boulder Laboratories, Chris Muzny director
Quantity | Value | Units | Method | Reference | Comment |
---|---|---|---|---|---|
Tboil | 410.4 | K | N/A | Timmermans, 1927 | Uncertainty assigned by TRC = 0.6 K; source of data not clear |

Kovats' RI, non-polar column, isothermal

View large format table.

Column type Active phase Temperature (C) I Reference Comment
PackedApiezon L120.742.Bogoslovsky, Anvaer, et al., 1978Celite 545
PackedApiezon L160.742.Bogoslovsky, Anvaer, et al., 1978Celite 545

References

Timmermans, 1927
Timmermans, J.,
The Melting Point of Organic Substances,
Bull. Soc. Chim. Belg., 1927, 36, 502. [all data]