9,12-Octadecadienoic acid, methyl ester, (E,E)-
- Formula: C19H34O2
- Molecular weight: 294.4721
- IUPAC Standard InChIKey: WTTJVINHCBCLGX-ZDVGBALWSA-N
- CAS Registry Number: 2566-97-4
- Chemical structure:
- Stereoisomers:
- Other names: Linolelaidic acid, methyl ester; Methyl linolelaidate; Methyl trans,trans-9,12-octadecadienoate; Methyl 9-trans-12-trans-octadecadienoate; Methyl (E, E)-9,12-octadecadienoate; trans-9,12-Octadecadienoic acid, methyl ester; methyl (9E,12E)-octadeca-9,12-dienoate

Condensed phase thermochemistry data

Data compiled by: Hussein Y. Afeefy, Joel F. Liebman, and Stephen E. Stein
Quantity | Value | Units | Method | Reference | Comment |
---|---|---|---|---|---|
ΔfH°liquid | -617.01 | kJ/mol | Chyd | Rogers and Siddiqui, 1975 |

Reaction thermochemistry data

Data compiled by: Hussein Y. Afeefy, Joel F. Liebman, and Stephen E. Stein
Individual Reactions
By formula: 2H2 + C19H34O2 = C19H38O2
Quantity | Value | Units | Method | Reference | Comment |
---|---|---|---|---|---|
ΔrH° | -233.0 ± 0.54 | kJ/mol | Chyd | Rogers and Siddiqui, 1975 | liquid phase; solvent: n-Hexane |

Van Den Dool and Kratz RI, polar column, temperature ramp

Column type | Active phase | I | Reference | Comment |
---|---|---|---|---|
Capillary | Supelcowax-10 | 2405. | Chung, Fung, et al., 2005 | 60. m/0.25 mm/0.25 μm, 35. C @ 5. min, 6. K/min, 195. C @ 60. min |

Normal alkane RI, non-polar column, temperature ramp

Column type | Active phase | I | Reference | Comment |
---|---|---|---|---|
Capillary | HP-5 MS | 1980. | Xu, Han, et al., 2012 | 30. m/0.25 mm/0.25 μm, 60. C @ 2. min, 15. K/min, 300. C @ 10. min |
Capillary | HP-5 MS | 1980. | Xu, Han, et al., 2009 | 30. m/0.25 mm/0.25 μm, Helium, 60. C @ 2. min, 15. K/min, 300. C @ 10. min |

References

Rogers and Siddiqui, 1975
Rogers, D.W.; Siddiqui, N.A.,
Heats of hydrogenation of large molecules. I. Esters of unsaturated fatty acids,
J. Phys. Chem., 1975, 79, 574-577. [all data]
Chung, Fung, et al., 2005
Chung, H.Y.; Fung, P.K.; Kim, J.-S.,
Aroma impact components in commercial plain sufu,
J. Agric. Food Chem., 2005, 53, 5, 1684-1691, https://doi.org/10.1021/jf048617d
. [all data]
Xu, Han, et al., 2012
Xu, L.-L.; Han, T.; Wu, J.-Z.; Zhang, Q.-Y.; Zhang, H.; Huang, B.-K.; Rahman, K.,
Comparative research of chemical constituents, antifungal and antitumor properties of ether extracts of Panax ginseng and its endophytic fungus, 2012, retrieved from http://www.thefreelibrary.com/Comparative .... [all data]
Xu, Han, et al., 2009
Xu, L.-L.; Han, T.; Wu, J.-Z.; Zhang, Q.-Y.; Zhang, H.; Huang, B.-K.; Rahman, K.,
Comparative research of chemical constituents, antifungal and antitumor properties of ether extracts of Panax ginseng and its endophytic fungus,
Phytomedicine: Int. J. Phytotherapy Phytopharmacology, 2009, 16, 6-7, 609-616, https://doi.org/10.1016/j.phymed.2009.03.014
. [all data]