5,8,11,14-Eicosatetraenoic acid, methyl ester, (all-Z)-
- Formula: C21H34O2
- Molecular weight: 318.4935
- IUPAC Standard InChIKey: OFIDNKMQBYGNIW-ZKWNWVNESA-N
- CAS Registry Number: 2566-89-4
- Chemical structure:

Phase change data

Data compiled by: William E. Acree, Jr., James S. Chickos
Quantity | Value | Units | Method | Reference | Comment |
---|---|---|---|---|---|
ΔvapH° | 118.3 | kJ/mol | CGC | Lipkind, Kapustin, et al., 2007 | |
ΔvapH° | 122.6 ± 1.6 | kJ/mol | CGC | Lipkind, Kapustin, et al., 2007 |

Kovats' RI, non-polar column, isothermal

Column type | Active phase | Temperature (C) | I | Reference | Comment |
---|---|---|---|---|---|
Packed | SE-30 | 200. | 2231. | Golovnya and Kuzmenko, 1977 | He, Chromosorb W (80-100 mesh); Column length: 1.5 m |
Packed | SE-30 | 200. | 2231. | Golovnya, Uralets, et al., 1976 | Gas Chrom Q (80-100 mesh); Column length: 1.5 m |

Van Den Dool and Kratz RI, non-polar column, custom temperature program

Column type | Active phase | I | Reference | Comment |
---|---|---|---|---|
Capillary | VF-5MS | 2274.4 | Tret'yakov, 2007 | 30. m/0.25 mm/0.25 μm, He; Program: Multi-step temperature program; T(initial)=60C; T(final)=270C |

References

Lipkind, Kapustin, et al., 2007
Lipkind, Dmitry; Kapustin, Yaroslav; Umnahanant, Patamaporn; Chickos, James S.,
The vaporization enthalpies and vapor pressures of a series of unsaturated fatty acid methyl esters by correlation gas chromatography,
Thermochimica Acta, 2007, 456, 2, 94-101, https://doi.org/10.1016/j.tca.2007.02.008
. [all data]
Golovnya and Kuzmenko, 1977
Golovnya, R.V.; Kuzmenko, T.E.,
Thermodynamic evaluation of the interaction of fatty acid methyl esters with polar and non-polar stationary phases, based on their retention indices,
Chromatographia, 1977, 10, 9, 545-548, https://doi.org/10.1007/BF02262915
. [all data]
Golovnya, Uralets, et al., 1976
Golovnya, R.V.; Uralets, V.P.; Kuzmenko, T.E.,
Characterization of fatty acid methyl esters by gas chromatography on siloxane liquid phases,
J. Chromatogr., 1976, 121, 1, 118-121, https://doi.org/10.1016/S0021-9673(00)82312-2
. [all data]
Tret'yakov, 2007
Tret'yakov, K.V.,
Retention Data. NIST Mass Spectrometry Data Center., NIST Mass Spectrometry Data Center, 2007. [all data]