Bicyclo[2.2.1]heptan-7-ol
- Formula: C7H12O
- Molecular weight: 112.1696
- IUPAC Standard InChIKey: QSOLQDIOEJREPU-UHFFFAOYSA-N
- CAS Registry Number: 2566-48-5
- Chemical structure:
View 3d structure (requires JavaScript / HTML 5) - Other names: 7-Norbornanol; 7-Hydroxynorbornane; 7-Norborneol; 7-Bicyclo(2.2.1)heptanol

Gas phase thermochemistry data

Data compiled by: Hussein Y. Afeefy, Joel F. Liebman, and Stephen E. Stein
Quantity | Value | Units | Method | Reference | Comment |
---|---|---|---|---|---|
ΔfH°gas | -218. ± 8.4 | kJ/mol | Ccb | Steele, 1979 |

References

Steele, 1979
Steele, W.V.,
Thermochemically determined ΔH°f(g) values for ketones and alcohols,
Private Communication, University of Stirling, Stirling, Scotland, 1979, 0. [all data]