L-Phenylalanine, N-benzoyl-
- Formula: C16H15NO3
- Molecular weight: 269.2952
- IUPAC Standard InChIKey: NPKISZUVEBESJI-AWEZNQCLSA-N
- CAS Registry Number: 2566-22-5
- Chemical structure:
View 3d structure (requires JavaScript / HTML 5) - Stereoisomers:
- Other names: N-Benzoyl-l-phenylalanine; Benzoyl-l-phenylalanine; L-BPA; N-Benzoylphenylalanine, L-; (2S)-2-(Benzoylamino)-3-phenylpropanoic acid

Condensed phase thermochemistry data

Data compiled by: Hussein Y. Afeefy, Joel F. Liebman, and Stephen E. Stein
Quantity | Value | Units | Method | Reference | Comment |
---|---|---|---|---|---|
ΔcH°solid | -7941.4 | kJ/mol | Ccb | Lemoult, 1904 |

References

Lemoult, 1904
Lemoult, M.P.,
Remarques sur une serie recenie de determinations calorimetriques,
Compt. Rend., 1904, 663-635. [all data]