Benzo[c]bicyclo[4.4.1]undeca-1,3,5,7,9-pentaene
- Formula: C15H12
- Molecular weight: 192.2558
- IUPAC Standard InChIKey: VHIHMGCWGKHWHW-UHFFFAOYSA-N
- CAS Registry Number: 256-61-1
- Chemical structure:
View 3d structure (requires JavaScript / HTML 5) - Permanent link for this species. Use this link for bookmarking this species for future reference.

Gas phase thermochemistry data

Data compiled by: Glushko Thermocenter, Russian Academy of Sciences, Moscow
Constant pressure heat capacity of gas
Cp,gas (cal/mol*K) | Temperature (K) | Reference | Comment |
---|---|---|---|
15.00 | 100. | Espinosa-Muller A., 1978 | These values were calculated by a method of force field; their uncertainties may exceed 5-10 J/mol*K. |
29.661 | 200. | ||
45.961 | 298.15 | ||
46.260 | 300. | ||
62.010 | 400. | ||
75.741 | 500. | ||
87.151 | 600. | ||
96.620 | 700. | ||
104.51 | 800. | ||
111.12 | 900. | ||
116.70 | 1000. |

References

Espinosa-Muller A., 1978
Espinosa-Muller A.,
Conformational and thermodynamical prediction of the 1,5-methano(10)-annulene, 1,6-methano(10)-annulene, and some benzo derivatives,
J. Chem. Phys., 1978, 69, 367-372. [all data]