2-Ethoxy-4-methylphenol
- Formula: C9H12O2
- Molecular weight: 152.1904
- IUPAC Standard InChIKey: ZWQBCCVEOIYNDL-UHFFFAOYSA-N
- CAS Registry Number: 2563-07-7
- Chemical structure:
View 3d structure (requires JavaScript / HTML 5) - Other names: Phenol, 2-ethoxy-4-methyl-

Phase change data

Data compiled by: Robert L. Brown and Stephen E. Stein
Reduced pressure boiling point
Tboil (K) | Pressure (bar) | Reference |
---|---|---|
380. to 383. | 0.019 | Frinton Laboratories Inc., 1986 |

References

Frinton Laboratories Inc., 1986
Frinton Laboratories Inc.,
Catalog Number 11, Frinton Laboratories Inc., Vineland, NJ, 1986, 99. [all data]