CAS Reg. No. 25590-58-3
- CAS Registry Number: 25590-58-3

Reaction thermochemistry data

Data compiled by: John E. Bartmess
Individual Reactions
(CAS Reg. No. 25590-58-3 • 4294967295) +
= CAS Reg. No. 25590-58-3
By formula: (CAS Reg. No. 25590-58-3 • 4294967295C2H3NO2) + C2H3NO2 = CAS Reg. No. 25590-58-3
Quantity | Value | Units | Method | Reference | Comment |
---|---|---|---|---|---|
ΔrH° | 326. ± 13. | kJ/mol | N/A | Bartmess, Scott, et al., 1979 | gas phase; value altered from reference due to change in acidity scale |

References

Bartmess, Scott, et al., 1979
Bartmess, J.E.; Scott, J.A.; McIver, R.T., Jr.,
The gas phase acidity scale from methanol to phenol,
J. Am. Chem. Soc., 1979, 101, 6047. [all data]